falcon-dev mailing list archives

Site index · List index
Message view « Date » · « Thread »
Top « Date » · « Thread »
From "Peeyush Bishnoi (JIRA)" <j...@apache.org>
Subject [jira] [Created] (FALCON-993) Falcon Oozie adaptor test case failed with umask issue
Date Thu, 15 Jan 2015 11:22:34 GMT
Peeyush Bishnoi created FALCON-993:
--------------------------------------

             Summary: Falcon Oozie adaptor test case failed with umask issue
                 Key: FALCON-993
                 URL: https://issues.apache.org/jira/browse/FALCON-993
             Project: Falcon
          Issue Type: Bug
          Components: oozie
         Environment: Ubuntu 14.04 , Centos 6.4 
            Reporter: Peeyush Bishnoi


Following Falcon Oozie adaptor test case failed with umask issue on Ubuntu and Centos but
successful on Mac OS. 

=========================================
Running org.apache.falcon.oozie.feed.OozieFeedWorkflowBuilderTest
Tests run: 12, Failures: 8, Errors: 0, Skipped: 0, Time elapsed: 10.667 sec <<< FAILURE!
- in org.apache.falcon.oozie.feed.OozieFeedWorkflowBuilderTest
testRetentionCoords(org.apache.falcon.oozie.feed.OozieFeedWorkflowBuilderTest)  Time elapsed:
0.2 sec  <<< FAILURE!
java.lang.AssertionError: expected:<493> but was:<509>
	at org.testng.Assert.fail(Assert.java:89)
	at org.testng.Assert.failNotEquals(Assert.java:489)
	at org.testng.Assert.assertEquals(Assert.java:118)
	at org.testng.Assert.assertEquals(Assert.java:365)
	at org.testng.Assert.assertEquals(Assert.java:375)
	at org.apache.falcon.oozie.feed.OozieFeedWorkflowBuilderTest.verifyClusterLocationsUMask(OozieFeedWorkflowBuilderTest.java:728)
	at org.apache.falcon.oozie.feed.OozieFeedWorkflowBuilderTest.testRetentionCoords(OozieFeedWorkflowBuilderTest.java:614)
=========================================



--
This message was sent by Atlassian JIRA
(v6.3.4#6332)

Mime
View raw message