falcon-dev mailing list archives

Site index · List index
Message view « Date » · « Thread »
Top « Date » · « Thread »
From Apache Jenkins Server <jenk...@builds.apache.org>
Subject Build failed in Jenkins: Apache-falcon #518
Date Fri, 02 Jan 2015 00:26:42 GMT
See <https://builds.apache.org/job/Apache-falcon/518/>

------------------------------------------
[...truncated 28 lines...]
[Apache-falcon] $ /bin/bash -xe /tmp/hudson5366767692652317280.sh
+ source <https://builds.apache.org/job/Apache-falcon/ws/nightly/hudsonEnv.sh>
++ export TOOLS_HOME=/home/jenkins/tools
++ TOOLS_HOME=/home/jenkins/tools
++ export JAVA_HOME=/home/jenkins/tools/java/latest
++ JAVA_HOME=/home/jenkins/tools/java/latest
++ export ANT_HOME=/home/jenkins/tools/ant/latest
++ ANT_HOME=/home/jenkins/tools/ant/latest
++ export FORREST_HOME=/home/jenkins/tools/forrest/latest
++ FORREST_HOME=/home/jenkins/tools/forrest/latest
++ export JAVA5_HOME=/home/jenkins/tools/java/latest1.5
++ JAVA5_HOME=/home/jenkins/tools/java/latest1.5
++ export FINDBUGS_HOME=/home/jenkins/tools/findbugs/latest
++ FINDBUGS_HOME=/home/jenkins/tools/findbugs/latest
++ export CLOVER_HOME=/home/jenkins/tools/clover/latest
++ CLOVER_HOME=/home/jenkins/tools/clover/latest
++ export MAVEN_HOME=/home/jenkins/tools/maven/latest
++ MAVEN_HOME=/home/jenkins/tools/maven/latest
++ export PATH=/home/jenkins/tools/java/latest1.6/bin:/home/jenkins/tools/java/latest1.6/bin:/usr/local/sbin:/usr/local/bin:/usr/sbin:/usr/bin:/sbin:/bin:/usr/games:/usr/local/games:/home/jenkins/tools/java/latest/bin:/home/jenkins/tools/ant/latest/bin:
++ PATH=/home/jenkins/tools/java/latest1.6/bin:/home/jenkins/tools/java/latest1.6/bin:/usr/local/sbin:/usr/local/bin:/usr/sbin:/usr/bin:/sbin:/bin:/usr/games:/usr/local/games:/home/jenkins/tools/java/latest/bin:/home/jenkins/tools/ant/latest/bin:
++ export ANT_OPTS=-Xmx2048m
++ ANT_OPTS=-Xmx2048m
++ export MAVEN_OPTS=-Xmx2048m
++ MAVEN_OPTS=-Xmx2048m
++ TRUNK=<https://builds.apache.org/job/Apache-falcon/ws/trunk>
++ ulimit -n
60000
+ export 'MAVEN_OPTS=-Xmx1024m -XX:MaxPermSize=256m'
+ MAVEN_OPTS='-Xmx1024m -XX:MaxPermSize=256m'
+ /home/jenkins/tools/maven/latest/bin/mvn clean verify -P test-patch,hadoop-2 -Drat.numUnapprovedLicenses=100
[INFO] Scanning for projects...
[WARNING] 
[WARNING] Some problems were encountered while building the effective model for org.apache.falcon:falcon-client:jar:0.4-incubating
[WARNING] 'dependencyManagement.dependencies.dependency.(groupId:artifactId:type:classifier)'
must be unique: org.apache.hive:hive-metastore:jar -> duplicate declaration of version
${hive.version} @ org.apache.falcon:falcon-main:0.4-incubating, <https://builds.apache.org/job/Apache-falcon/ws/pom.xml,>
line 743, column 25
[WARNING] 
[WARNING] Some problems were encountered while building the effective model for org.apache.falcon:falcon-metrics:jar:0.4-incubating
[WARNING] 'dependencyManagement.dependencies.dependency.(groupId:artifactId:type:classifier)'
must be unique: org.apache.hive:hive-metastore:jar -> duplicate declaration of version
${hive.version} @ org.apache.falcon:falcon-main:0.4-incubating, <https://builds.apache.org/job/Apache-falcon/ws/pom.xml,>
line 743, column 25
[WARNING] 
[WARNING] Some problems were encountered while building the effective model for org.apache.falcon:falcon-common:jar:0.4-incubating
[WARNING] 'dependencyManagement.dependencies.dependency.(groupId:artifactId:type:classifier)'
must be unique: org.apache.hive:hive-metastore:jar -> duplicate declaration of version
${hive.version} @ org.apache.falcon:falcon-main:0.4-incubating, <https://builds.apache.org/job/Apache-falcon/ws/pom.xml,>
line 743, column 25
[WARNING] 
[WARNING] Some problems were encountered while building the effective model for org.apache.falcon:falcon-test-util:jar:0.4-incubating
[WARNING] 'dependencyManagement.dependencies.dependency.(groupId:artifactId:type:classifier)'
must be unique: org.apache.hive:hive-metastore:jar -> duplicate declaration of version
${hive.version} @ org.apache.falcon:falcon-main:0.4-incubating, <https://builds.apache.org/job/Apache-falcon/ws/pom.xml,>
line 743, column 25
[WARNING] 
[WARNING] Some problems were encountered while building the effective model for org.apache.falcon:falcon-hadoop-dependencies:jar:0.4-incubating
[WARNING] 'dependencyManagement.dependencies.dependency.(groupId:artifactId:type:classifier)'
must be unique: org.apache.hive:hive-metastore:jar -> duplicate declaration of version
${hive.version} @ org.apache.falcon:falcon-main:0.4-incubating, <https://builds.apache.org/job/Apache-falcon/ws/pom.xml,>
line 743, column 25
[WARNING] 
[WARNING] Some problems were encountered while building the effective model for org.apache.falcon:falcon-hadoop-webapp:war:0.4-incubating
[WARNING] 'dependencyManagement.dependencies.dependency.(groupId:artifactId:type:classifier)'
must be unique: org.apache.hive:hive-metastore:jar -> duplicate declaration of version
${hive.version} @ org.apache.falcon:falcon-main:0.4-incubating, <https://builds.apache.org/job/Apache-falcon/ws/pom.xml,>
line 743, column 25
[WARNING] 
[WARNING] Some problems were encountered while building the effective model for org.apache.falcon:falcon-feed:jar:0.4-incubating
[WARNING] 'dependencyManagement.dependencies.dependency.(groupId:artifactId:type:classifier)'
must be unique: org.apache.hive:hive-metastore:jar -> duplicate declaration of version
${hive.version} @ org.apache.falcon:falcon-main:0.4-incubating, <https://builds.apache.org/job/Apache-falcon/ws/pom.xml,>
line 743, column 25
[WARNING] 
[WARNING] Some problems were encountered while building the effective model for org.apache.falcon:falcon-messaging:jar:0.4-incubating
[WARNING] 'dependencyManagement.dependencies.dependency.(groupId:artifactId:type:classifier)'
must be unique: org.apache.hive:hive-metastore:jar -> duplicate declaration of version
${hive.version} @ org.apache.falcon:falcon-main:0.4-incubating, <https://builds.apache.org/job/Apache-falcon/ws/pom.xml,>
line 743, column 25
[WARNING] 
[WARNING] Some problems were encountered while building the effective model for org.apache.falcon:falcon-process:jar:0.4-incubating
[WARNING] 'dependencyManagement.dependencies.dependency.(groupId:artifactId:type:classifier)'
must be unique: org.apache.hive:hive-metastore:jar -> duplicate declaration of version
${hive.version} @ org.apache.falcon:falcon-main:0.4-incubating, <https://builds.apache.org/job/Apache-falcon/ws/pom.xml,>
line 743, column 25
[WARNING] 
[WARNING] Some problems were encountered while building the effective model for org.apache.falcon:falcon-oozie-el-extension:jar:0.4-incubating
[WARNING] 'dependencyManagement.dependencies.dependency.(groupId:artifactId:type:classifier)'
must be unique: org.apache.hive:hive-metastore:jar -> duplicate declaration of version
${hive.version} @ org.apache.falcon:falcon-main:0.4-incubating, <https://builds.apache.org/job/Apache-falcon/ws/pom.xml,>
line 743, column 25
[WARNING] 
[WARNING] Some problems were encountered while building the effective model for org.apache.falcon:falcon-oozie-adaptor:jar:0.4-incubating
[WARNING] 'dependencyManagement.dependencies.dependency.(groupId:artifactId:type:classifier)'
must be unique: org.apache.hive:hive-metastore:jar -> duplicate declaration of version
${hive.version} @ org.apache.falcon:falcon-main:0.4-incubating, <https://builds.apache.org/job/Apache-falcon/ws/pom.xml,>
line 743, column 25
[WARNING] 
[WARNING] Some problems were encountered while building the effective model for org.apache.falcon:falcon-acquisition:jar:0.4-incubating
[WARNING] 'dependencyManagement.dependencies.dependency.(groupId:artifactId:type:classifier)'
must be unique: org.apache.hive:hive-metastore:jar -> duplicate declaration of version
${hive.version} @ org.apache.falcon:falcon-main:0.4-incubating, <https://builds.apache.org/job/Apache-falcon/ws/pom.xml,>
line 743, column 25
[WARNING] 
[WARNING] Some problems were encountered while building the effective model for org.apache.falcon:falcon-replication:jar:0.4-incubating
[WARNING] 'dependencyManagement.dependencies.dependency.(groupId:artifactId:type:classifier)'
must be unique: org.apache.hive:hive-metastore:jar -> duplicate declaration of version
${hive.version} @ org.apache.falcon:falcon-main:0.4-incubating, <https://builds.apache.org/job/Apache-falcon/ws/pom.xml,>
line 743, column 25
[WARNING] 
[WARNING] Some problems were encountered while building the effective model for org.apache.falcon:falcon-retention:jar:0.4-incubating
[WARNING] 'dependencyManagement.dependencies.dependency.(groupId:artifactId:type:classifier)'
must be unique: org.apache.hive:hive-metastore:jar -> duplicate declaration of version
${hive.version} @ org.apache.falcon:falcon-main:0.4-incubating, <https://builds.apache.org/job/Apache-falcon/ws/pom.xml,>
line 743, column 25
[WARNING] 
[WARNING] Some problems were encountered while building the effective model for org.apache.falcon:falcon-archival:jar:0.4-incubating
[WARNING] 'dependencyManagement.dependencies.dependency.(groupId:artifactId:type:classifier)'
must be unique: org.apache.hive:hive-metastore:jar -> duplicate declaration of version
${hive.version} @ org.apache.falcon:falcon-main:0.4-incubating, <https://builds.apache.org/job/Apache-falcon/ws/pom.xml,>
line 743, column 25
[WARNING] 
[WARNING] Some problems were encountered while building the effective model for org.apache.falcon:falcon-rerun:jar:0.4-incubating
[WARNING] 'dependencyManagement.dependencies.dependency.(groupId:artifactId:type:classifier)'
must be unique: org.apache.hive:hive-metastore:jar -> duplicate declaration of version
${hive.version} @ org.apache.falcon:falcon-main:0.4-incubating, <https://builds.apache.org/job/Apache-falcon/ws/pom.xml,>
line 743, column 25
[WARNING] 
[WARNING] Some problems were encountered while building the effective model for org.apache.falcon:falcon-prism:war:0.4-incubating
[WARNING] 'dependencyManagement.dependencies.dependency.(groupId:artifactId:type:classifier)'
must be unique: org.apache.hive:hive-metastore:jar -> duplicate declaration of version
${hive.version} @ org.apache.falcon:falcon-main:0.4-incubating, <https://builds.apache.org/job/Apache-falcon/ws/pom.xml,>
line 743, column 25
[WARNING] 
[WARNING] Some problems were encountered while building the effective model for org.apache.falcon:falcon-webapp:war:0.4-incubating
[WARNING] 'dependencyManagement.dependencies.dependency.(groupId:artifactId:type:classifier)'
must be unique: org.apache.hive:hive-metastore:jar -> duplicate declaration of version
${hive.version} @ org.apache.falcon:falcon-main:0.4-incubating, <https://builds.apache.org/job/Apache-falcon/ws/pom.xml,>
line 743, column 25
[WARNING] 
[WARNING] Some problems were encountered while building the effective model for org.apache.falcon:falcon-docs:jar:0.4-incubating
[WARNING] 'dependencyManagement.dependencies.dependency.(groupId:artifactId:type:classifier)'
must be unique: org.apache.hive:hive-metastore:jar -> duplicate declaration of version
${hive.version} @ org.apache.falcon:falcon-main:0.4-incubating, <https://builds.apache.org/job/Apache-falcon/ws/pom.xml,>
line 743, column 25
[WARNING] 
[WARNING] Some problems were encountered while building the effective model for org.apache.falcon:falcon-main:pom:0.4-incubating
[WARNING] 'dependencyManagement.dependencies.dependency.(groupId:artifactId:type:classifier)'
must be unique: org.apache.hive:hive-metastore:jar -> duplicate declaration of version
${hive.version} @ line 743, column 25
[WARNING] 
[WARNING] It is highly recommended to fix these problems because they threaten the stability
of your build.
[WARNING] 
[WARNING] For this reason, future Maven versions might no longer support building such malformed
projects.
[WARNING] 
[INFO] ------------------------------------------------------------------------
[INFO] Reactor Build Order:
[INFO] 
[INFO] Build Tools
[INFO] Apache Falcon
[INFO] Apache Falcon CLI client
[INFO] Apache Falcon Metrics
[INFO] Apache Falcon Test Utility
[INFO] Apache Falcon Commons
[INFO] Apache Falcon Hadoop Dependencies
[INFO] Apache Falcon Oozie EL Extension
[INFO] Apache Falcon Embedded Hadoop - Test Cluster
[INFO] Apache Falcon Messaging
[INFO] Apache Falcon Oozie Adaptor
[INFO] Apache Falcon Feed
[INFO] Apache Falcon Process
[INFO] Apache Falcon Acquisition
[INFO] Apache Falcon Replication
[INFO] Apache Falcon Retention
[INFO] Apache Falcon Archival
[INFO] Apache Falcon Rerun
[INFO] Apache Falcon Prism
[INFO] Apache Falcon Web Application
[INFO] Apache Falcon Documentation
[INFO] 
[INFO] Using the builder org.apache.maven.lifecycle.internal.builder.singlethreaded.SingleThreadedBuilder
with a thread count of 1
[INFO]                                                                         
[INFO] ------------------------------------------------------------------------
[INFO] Building Build Tools 0.4-incubating
[INFO] ------------------------------------------------------------------------
[INFO] 
[INFO] --- maven-clean-plugin:2.5:clean (default-clean) @ build-tools ---
[INFO] 
[INFO] --- exec-maven-plugin:1.1:exec (BUILD-OOZIE) @ build-tools ---
[INFO] Using maven from  /home/jenkins/tools/maven/latest/bin/mvn
[INFO] ~/jenkins-slave/workspace/Apache-falcon/target ~/jenkins-slave/workspace/Apache-falcon/build-tools
[INFO] * Hostname was NOT found in DNS cache
[INFO]   % Total    % Received % Xferd  Average Speed   Time    Time     Time  Current
[INFO]                                  Dload  Upload   Total   Spent    Left  Speed
[INFO] 
[INFO]   0     0    0     0    0     0      0      0 --:--:-- --:--:-- --:--:--     0*   Trying
54.172.167.43...
[INFO] * Connected to www.apache.org (54.172.167.43) port 80 (#0)
[INFO] > GET /dist/oozie/4.0.0/oozie-4.0.0.tar.gz HTTP/1.1
[INFO] > User-Agent: curl/7.35.0
[INFO] > Host: www.apache.org
[INFO] > Accept: */*
[INFO] > 
[INFO] < HTTP/1.1 404 Not Found
[INFO] < Date: Fri, 02 Jan 2015 00:26:39 GMT
[INFO] * Server Apache/2.4.7 (Ubuntu) is not blacklisted
[INFO] < Server: Apache/2.4.7 (Ubuntu)
[INFO] < Content-Length: 233
[INFO] < Content-Type: text/html; charset=iso-8859-1
[INFO] < 
[INFO] { [data not shown]
[INFO] 
[INFO] 100   233  100   233    0     0   1391      0 --:--:-- --:--:-- --:--:--  1395
[INFO] * Connection #0 to host www.apache.org left intact
[INFO] 
[INFO] gzip: stdin: not in gzip format
[INFO] tar: Child returned status 1
[INFO] tar: Error is not recoverable: exiting now
[INFO] ------------------------------------------------------------------------
[INFO] Reactor Summary:
[INFO] 
[INFO] Build Tools ....................................... FAILURE [  3.015 s]
[INFO] Apache Falcon ..................................... SKIPPED
[INFO] Apache Falcon CLI client .......................... SKIPPED
[INFO] Apache Falcon Metrics ............................. SKIPPED
[INFO] Apache Falcon Test Utility ........................ SKIPPED
[INFO] Apache Falcon Commons ............................. SKIPPED
[INFO] Apache Falcon Hadoop Dependencies ................. SKIPPED
[INFO] Apache Falcon Oozie EL Extension .................. SKIPPED
[INFO] Apache Falcon Embedded Hadoop - Test Cluster ...... SKIPPED
[INFO] Apache Falcon Messaging ........................... SKIPPED
[INFO] Apache Falcon Oozie Adaptor ....................... SKIPPED
[INFO] Apache Falcon Feed ................................ SKIPPED
[INFO] Apache Falcon Process ............................. SKIPPED
[INFO] Apache Falcon Acquisition ......................... SKIPPED
[INFO] Apache Falcon Replication ......................... SKIPPED
[INFO] Apache Falcon Retention ........................... SKIPPED
[INFO] Apache Falcon Archival ............................ SKIPPED
[INFO] Apache Falcon Rerun ............................... SKIPPED
[INFO] Apache Falcon Prism ............................... SKIPPED
[INFO] Apache Falcon Web Application ..................... SKIPPED
[INFO] Apache Falcon Documentation ....................... SKIPPED
[INFO] ------------------------------------------------------------------------
[INFO] BUILD FAILURE
[INFO] ------------------------------------------------------------------------
[INFO] Total time: 3.492 s
[INFO] Finished at: 2015-01-02T00:26:39+00:00
[INFO] Final Memory: 11M/723M
[INFO] ------------------------------------------------------------------------
[WARNING] The requested profile "test-patch" could not be activated because it does not exist.
[ERROR] Failed to execute goal org.codehaus.mojo:exec-maven-plugin:1.1:exec (BUILD-OOZIE)
on project build-tools: Result of /bin/sh -c cd <https://builds.apache.org/job/Apache-falcon/ws/build-tools>
&& src/bin/oozie-patch-pkg.sh execution is: '2'. -> [Help 1]
[ERROR] 
[ERROR] To see the full stack trace of the errors, re-run Maven with the -e switch.
[ERROR] Re-run Maven using the -X switch to enable full debug logging.
[ERROR] 
[ERROR] For more information about the errors and possible solutions, please read the following
articles:
[ERROR] [Help 1] http://cwiki.apache.org/confluence/display/MAVEN/MojoExecutionException
Build step 'Execute shell' marked build as failure
[CHECKSTYLE] Collecting checkstyle analysis files...
[CHECKSTYLE] Finding all files that match the pattern **/target/checkstyle-result.xml
[CHECKSTYLE] Parsing 18 files in <https://builds.apache.org/job/Apache-falcon/ws/>
[CHECKSTYLE] Successfully parsed file <https://builds.apache.org/job/Apache-falcon/ws/acquisition/target/checkstyle-result.xml>
of module  with 0 warnings.
[CHECKSTYLE] Successfully parsed file <https://builds.apache.org/job/Apache-falcon/ws/archival/target/checkstyle-result.xml>
of module  with 0 warnings.
[CHECKSTYLE] Successfully parsed file <https://builds.apache.org/job/Apache-falcon/ws/client/target/checkstyle-result.xml>
of module  with 0 warnings.
[CHECKSTYLE] Successfully parsed file <https://builds.apache.org/job/Apache-falcon/ws/common/target/checkstyle-result.xml>
of module  with 0 warnings.
[CHECKSTYLE] Successfully parsed file <https://builds.apache.org/job/Apache-falcon/ws/docs/target/checkstyle-result.xml>
of module  with 0 warnings.
[CHECKSTYLE] Successfully parsed file <https://builds.apache.org/job/Apache-falcon/ws/feed/target/checkstyle-result.xml>
of module  with 0 warnings.
[CHECKSTYLE] Successfully parsed file <https://builds.apache.org/job/Apache-falcon/ws/hadoop-dependencies/target/checkstyle-result.xml>
of module  with 0 warnings.
[CHECKSTYLE] Successfully parsed file <https://builds.apache.org/job/Apache-falcon/ws/metrics/target/checkstyle-result.xml>
of module  with 0 warnings.
[CHECKSTYLE] Successfully parsed file <https://builds.apache.org/job/Apache-falcon/ws/oozie-el-extensions/target/checkstyle-result.xml>
of module  with 0 warnings.
[CHECKSTYLE] Successfully parsed file <https://builds.apache.org/job/Apache-falcon/ws/oozie/target/checkstyle-result.xml>
of module  with 0 warnings.
[CHECKSTYLE] Successfully parsed file <https://builds.apache.org/job/Apache-falcon/ws/prism/target/checkstyle-result.xml>
of module  with 0 warnings.
[CHECKSTYLE] Successfully parsed file <https://builds.apache.org/job/Apache-falcon/ws/process/target/checkstyle-result.xml>
of module  with 0 warnings.
[CHECKSTYLE] Successfully parsed file <https://builds.apache.org/job/Apache-falcon/ws/replication/target/checkstyle-result.xml>
of module  with 0 warnings.
[CHECKSTYLE] Successfully parsed file <https://builds.apache.org/job/Apache-falcon/ws/rerun/target/checkstyle-result.xml>
of module  with 0 warnings.
[CHECKSTYLE] Successfully parsed file <https://builds.apache.org/job/Apache-falcon/ws/retention/target/checkstyle-result.xml>
of module  with 0 warnings.
[CHECKSTYLE] Successfully parsed file <https://builds.apache.org/job/Apache-falcon/ws/target/checkstyle-result.xml>
of module  with 0 warnings.
[CHECKSTYLE] Successfully parsed file <https://builds.apache.org/job/Apache-falcon/ws/test-util/target/checkstyle-result.xml>
of module  with 0 warnings.
[CHECKSTYLE] Successfully parsed file <https://builds.apache.org/job/Apache-falcon/ws/webapp/target/checkstyle-result.xml>
of module  with 0 warnings.
[CHECKSTYLE] Computing warning deltas based on reference build #511
[FINDBUGS] Collecting findbugs analysis files...
[FINDBUGS] Finding all files that match the pattern **/target/findbugs.xml
[FINDBUGS] Parsing 14 files in <https://builds.apache.org/job/Apache-falcon/ws/>
[FINDBUGS] Successfully parsed file <https://builds.apache.org/job/Apache-falcon/ws/client/target/findbugs.xml>
of module  with 0 warnings.
[FINDBUGS] Successfully parsed file <https://builds.apache.org/job/Apache-falcon/ws/common/target/findbugs.xml>
of module  with 0 warnings.
[FINDBUGS] Successfully parsed file <https://builds.apache.org/job/Apache-falcon/ws/feed/target/findbugs.xml>
of module  with 0 warnings.
[FINDBUGS] Successfully parsed file <https://builds.apache.org/job/Apache-falcon/ws/hadoop-dependencies/target/findbugs.xml>
of module  with 0 warnings.
[FINDBUGS] Successfully parsed file <https://builds.apache.org/job/Apache-falcon/ws/metrics/target/findbugs.xml>
of module  with 0 warnings.
[FINDBUGS] Successfully parsed file <https://builds.apache.org/job/Apache-falcon/ws/oozie-el-extensions/target/findbugs.xml>
of module  with 0 warnings.
[FINDBUGS] Successfully parsed file <https://builds.apache.org/job/Apache-falcon/ws/oozie/target/findbugs.xml>
of module  with 0 warnings.
[FINDBUGS] Successfully parsed file <https://builds.apache.org/job/Apache-falcon/ws/prism/target/findbugs.xml>
of module  with 0 warnings.
[FINDBUGS] Successfully parsed file <https://builds.apache.org/job/Apache-falcon/ws/process/target/findbugs.xml>
of module  with 0 warnings.
[FINDBUGS] Successfully parsed file <https://builds.apache.org/job/Apache-falcon/ws/replication/target/findbugs.xml>
of module  with 0 warnings.
[FINDBUGS] Successfully parsed file <https://builds.apache.org/job/Apache-falcon/ws/rerun/target/findbugs.xml>
of module  with 0 warnings.
[FINDBUGS] Successfully parsed file <https://builds.apache.org/job/Apache-falcon/ws/retention/target/findbugs.xml>
of module  with 0 warnings.
[FINDBUGS] Successfully parsed file <https://builds.apache.org/job/Apache-falcon/ws/test-util/target/findbugs.xml>
of module  with 0 warnings.
[FINDBUGS] Successfully parsed file <https://builds.apache.org/job/Apache-falcon/ws/webapp/target/findbugs.xml>
of module  with 0 warnings.
[FINDBUGS] Computing warning deltas based on reference build #511
Archiving artifacts
Sending artifact delta relative to Apache-falcon #511
Archived 12 artifacts
Archive block size is 32768
Received 234 blocks and 90262 bytes
Compression is 98.8%
Took 0.49 sec
Recording test results
TestNG Reports Processing: START
Looking for TestNG results report in workspace using pattern: **/target/testng-results.xml
Did not find any matching files.

Mime
View raw message