falcon-dev mailing list archives

Site index · List index
Message view « Date » · « Thread »
Top « Date » · « Thread »
From Apache Jenkins Server <jenk...@builds.apache.org>
Subject Build failed in Jenkins: Apache-falcon #531
Date Mon, 12 Jan 2015 02:09:31 GMT
See <https://builds.apache.org/job/Apache-falcon/531/changes>

Changes:

[sriksun] FALCON-237 Falcon feed replication should honour availability flag. Contributed
by Peeyush Bishnoi

[sriksun] FALCON-984 Falcon build is broken. Contributed by Peeyush Bishnoi

------------------------------------------
[...truncated 5024 lines...]
	at org.testng.Assert.assertEquals(Assert.java:118)
	at org.testng.Assert.assertEquals(Assert.java:365)
	at org.testng.Assert.assertEquals(Assert.java:375)
	at org.apache.falcon.cli.FalconCLIIT.submitTestFiles(FalconCLIIT.java:885)
	at org.apache.falcon.cli.FalconCLIIT.testInstanceSuspendAndResume(FalconCLIIT.java:432)

testMetadataListCommands(org.apache.falcon.cli.FalconCLIIT)  Time elapsed: 0.343 sec  <<<
FAILURE!
java.lang.AssertionError: expected:<0> but was:<-1>
	at org.testng.Assert.fail(Assert.java:89)
	at org.testng.Assert.failNotEquals(Assert.java:489)
	at org.testng.Assert.assertEquals(Assert.java:118)
	at org.testng.Assert.assertEquals(Assert.java:365)
	at org.testng.Assert.assertEquals(Assert.java:375)
	at org.apache.falcon.cli.FalconCLIIT.submitTestFiles(FalconCLIIT.java:885)
	at org.apache.falcon.cli.FalconCLIIT.testMetadataListCommands(FalconCLIIT.java:590)

testMetadataRelationsCommands(org.apache.falcon.cli.FalconCLIIT)  Time elapsed: 0.327 sec
 <<< FAILURE!
java.lang.AssertionError: expected:<0> but was:<-1>
	at org.testng.Assert.fail(Assert.java:89)
	at org.testng.Assert.failNotEquals(Assert.java:489)
	at org.testng.Assert.assertEquals(Assert.java:118)
	at org.testng.Assert.assertEquals(Assert.java:365)
	at org.testng.Assert.assertEquals(Assert.java:375)
	at org.apache.falcon.cli.FalconCLIIT.submitTestFiles(FalconCLIIT.java:885)
	at org.apache.falcon.cli.FalconCLIIT.testMetadataRelationsCommands(FalconCLIIT.java:627)

testRecipeCommand(org.apache.falcon.cli.FalconCLIIT)  Time elapsed: 0.347 sec  <<<
FAILURE!
java.lang.AssertionError: expected:<0> but was:<-1>
	at org.testng.Assert.fail(Assert.java:89)
	at org.testng.Assert.failNotEquals(Assert.java:489)
	at org.testng.Assert.assertEquals(Assert.java:118)
	at org.testng.Assert.assertEquals(Assert.java:365)
	at org.testng.Assert.assertEquals(Assert.java:375)
	at org.apache.falcon.cli.FalconCLIIT.recipeSetup(FalconCLIIT.java:826)
	at org.apache.falcon.cli.FalconCLIIT.testRecipeCommand(FalconCLIIT.java:809)

testScheduleEntityValidCommands(org.apache.falcon.cli.FalconCLIIT)  Time elapsed: 0.354 sec
 <<< FAILURE!
java.lang.AssertionError: expected:<0> but was:<-1>
	at org.testng.Assert.fail(Assert.java:89)
	at org.testng.Assert.failNotEquals(Assert.java:489)
	at org.testng.Assert.assertEquals(Assert.java:118)
	at org.testng.Assert.assertEquals(Assert.java:365)
	at org.testng.Assert.assertEquals(Assert.java:375)
	at org.apache.falcon.cli.FalconCLIIT.submitTestFiles(FalconCLIIT.java:885)
	at org.apache.falcon.cli.FalconCLIIT.testScheduleEntityValidCommands(FalconCLIIT.java:169)

testSubmitAndScheduleEntityValidCommands(org.apache.falcon.cli.FalconCLIIT)  Time elapsed:
0.459 sec  <<< FAILURE!
java.lang.AssertionError: expected:<0> but was:<-1>
	at org.testng.Assert.fail(Assert.java:89)
	at org.testng.Assert.failNotEquals(Assert.java:489)
	at org.testng.Assert.assertEquals(Assert.java:118)
	at org.testng.Assert.assertEquals(Assert.java:365)
	at org.testng.Assert.assertEquals(Assert.java:375)
	at org.apache.falcon.cli.FalconCLIIT.testSubmitAndScheduleEntityValidCommands(FalconCLIIT.java:108)

testSubmitEntityValidCommands(org.apache.falcon.cli.FalconCLIIT)  Time elapsed: 0.321 sec
 <<< FAILURE!
java.lang.AssertionError: expected:<0> but was:<-1>
	at org.testng.Assert.fail(Assert.java:89)
	at org.testng.Assert.failNotEquals(Assert.java:489)
	at org.testng.Assert.assertEquals(Assert.java:118)
	at org.testng.Assert.assertEquals(Assert.java:365)
	at org.testng.Assert.assertEquals(Assert.java:375)
	at org.apache.falcon.cli.FalconCLIIT.testSubmitEntityValidCommands(FalconCLIIT.java:66)

testSuspendResumeStatusEntityValidCommands(org.apache.falcon.cli.FalconCLIIT)  Time elapsed:
0.353 sec  <<< FAILURE!
java.lang.AssertionError: expected:<0> but was:<-1>
	at org.testng.Assert.fail(Assert.java:89)
	at org.testng.Assert.failNotEquals(Assert.java:489)
	at org.testng.Assert.assertEquals(Assert.java:118)
	at org.testng.Assert.assertEquals(Assert.java:365)
	at org.testng.Assert.assertEquals(Assert.java:375)
	at org.apache.falcon.cli.FalconCLIIT.submitTestFiles(FalconCLIIT.java:885)
	at org.apache.falcon.cli.FalconCLIIT.testSuspendResumeStatusEntityValidCommands(FalconCLIIT.java:183)

testValidateValidCommands(org.apache.falcon.cli.FalconCLIIT)  Time elapsed: 0.309 sec  <<<
FAILURE!
java.lang.AssertionError: expected:<0> but was:<-1>
	at org.testng.Assert.fail(Assert.java:89)
	at org.testng.Assert.failNotEquals(Assert.java:489)
	at org.testng.Assert.assertEquals(Assert.java:118)
	at org.testng.Assert.assertEquals(Assert.java:365)
	at org.testng.Assert.assertEquals(Assert.java:375)
	at org.apache.falcon.cli.FalconCLIIT.testValidateValidCommands(FalconCLIIT.java:131)

Running org.apache.falcon.catalog.HiveCatalogServiceIT
Tests run: 21, Failures: 0, Errors: 0, Skipped: 0, Time elapsed: 14.61 sec - in org.apache.falcon.catalog.HiveCatalogServiceIT

Results :

Failed tests: 
  FeedEntityValidationIT.testFeedEntityWithInvalidTableUri:138 expected:<200> but was:<400>
  FeedEntityValidationIT.testFeedEntityWithInvalidTableUri:138 expected:<200> but was:<400>
  FeedEntityValidationIT.testFeedEntityWithInvalidTableUri:138 expected:<200> but was:<400>
  FeedEntityValidationIT.testFeedEntityWithInvalidTableUri:138 expected:<200> but was:<400>
  FeedEntityValidationIT.testFeedEntityWithInvalidTableUri:138 expected:<200> but was:<400>
  FeedEntityValidationIT.testFeedEntityWithInvalidTableUri:138 expected:<200> but was:<400>
  FeedEntityValidationIT.testFeedEntityWithValidTable:81 expected:<200> but was:<400>
  ClusterEntityValidationIT.testClusterEntityWithValidInterfaces:89 expected:<200> but
was:<400>
  ClusterEntityValidationIT.testValidateACL:150 expected:<200> but was:<400>
  ClusterEntityValidationIT.testValidateClusterLocations:156 » Validation Invali...
  EntityManagerPaginationJerseyIT.prepare:42->scheduleMultipleProcess:155 expected:<200>
but was:<400>
  EntityManagerJerseyIT.testClusterSubmitScheduleSuspendResumeDelete:463 expected:<200>
but was:<400>
  EntityManagerJerseyIT.cleanup:183 » OozieClient java.io.IOException: Error whi...
  EntityManagerJerseySmokeIT.testFeedSchedule:110 expected:<200> but was:<400>
  EntityManagerJerseySmokeIT.cleanup:60 » OozieClient java.io.IOException: Error...
  MetadataResourceJerseyIT.prepare:51 expected:<200> but was:<400>
  FalconCLISmokeIT.testSubmitAndScheduleEntityValidCommands:58 expected:<0> but was:<-1>
  FalconCLIIT.testClientProperties:723->submitTestFiles:885 expected:<0> but was:<-1>
  FalconCLIIT.testContinue:661->submitTestFiles:885 expected:<0> but was:<-1>
  FalconCLIIT.testDefinitionEntityValidCommands:153->submitTestFiles:885 expected:<0>
but was:<-1>
  FalconCLIIT.testDeleteEntityValidCommands:246->submitTestFiles:885 expected:<0>
but was:<-1>
  FalconCLIIT.testEntityLineage:499 expected:<0> but was:<-1>
  FalconCLIIT.testEntityPaginationFilterByCommands:526 expected:<0> but was:<-1>
  FalconCLIIT.testInstanceGetLogs:749->submitTestFiles:885 expected:<0> but was:<-1>
  FalconCLIIT.testInstanceKillAndRerun:462->submitTestFiles:885 expected:<0> but
was:<-1>
  FalconCLIIT.testInstanceRunningAndStatusCommands:275->submitTestFiles:885 expected:<0>
but was:<-1>
  FalconCLIIT.testInstanceRunningAndSummaryCommands:404->submitTestFiles:885 expected:<0>
but was:<-1>
  FalconCLIIT.testInstanceSuspendAndResume:432->submitTestFiles:885 expected:<0>
but was:<-1>
  FalconCLIIT.testMetadataListCommands:590->submitTestFiles:885 expected:<0> but
was:<-1>
  FalconCLIIT.testMetadataRelationsCommands:627->submitTestFiles:885 expected:<0>
but was:<-1>
  FalconCLIIT.testRecipeCommand:809->recipeSetup:826 expected:<0> but was:<-1>
  FalconCLIIT.testScheduleEntityValidCommands:169->submitTestFiles:885 expected:<0>
but was:<-1>
  FalconCLIIT.testSubmitAndScheduleEntityValidCommands:108 expected:<0> but was:<-1>
  FalconCLIIT.testSubmitEntityValidCommands:66 expected:<0> but was:<-1>
  FalconCLIIT.testSuspendResumeStatusEntityValidCommands:183->submitTestFiles:885 expected:<0>
but was:<-1>
  FalconCLIIT.testValidateValidCommands:131 expected:<0> but was:<-1>

Tests run: 158, Failures: 36, Errors: 0, Skipped: 57

[INFO] 
[INFO] --- maven-jetty-plugin:6.1.26:stop (stop-jetty) @ falcon-webapp ---
[INFO] 
[INFO] --- maven-failsafe-plugin:2.16:verify (verify) @ falcon-webapp ---
[INFO] Stopping server 0
[INFO] Stopped SelectChannelConnector@0.0.0.0:41000
[INFO] Stopped SslSocketConnector@0.0.0.0:41443
[INFO] Failsafe report directory: <https://builds.apache.org/job/Apache-falcon/ws/webapp/target/failsafe-reports>
[INFO] ------------------------------------------------------------------------
[INFO] Reactor Summary:
[INFO] 
[INFO] Checkstyle ........................................ SUCCESS [  1.012 s]
[INFO] Apache Falcon ..................................... SUCCESS [  5.698 s]
[INFO] Build Tools ....................................... SUCCESS [  3.791 s]
[INFO] Apache Falcon CLI client .......................... SUCCESS [ 26.401 s]
[INFO] Apache Falcon Metrics ............................. SUCCESS [ 11.761 s]
[INFO] Apache Falcon Hadoop Dependencies ................. SUCCESS [ 13.918 s]
[INFO] Apache Falcon Test Utility ........................ SUCCESS [ 11.358 s]
[INFO] Apache Falcon Commons ............................. SUCCESS [01:35 min]
[INFO] Apache Falcon Oozie EL Extension .................. SUCCESS [ 15.145 s]
[INFO] Apache Falcon Embedded Hadoop - Test Cluster ...... SUCCESS [ 28.896 s]
[INFO] Apache Falcon Sharelib Hive - Test Cluster ........ SUCCESS [  1.357 s]
[INFO] Apache Falcon Sharelib Pig - Test Cluster ......... SUCCESS [  0.895 s]
[INFO] Apache Falcon Sharelib Hcatalog - Test Cluster .... SUCCESS [  0.944 s]
[INFO] Apache Falcon Sharelib Oozie - Test Cluster ....... SUCCESS [  0.540 s]
[INFO] Apache Falcon Test Tools - Test Cluster ........... SUCCESS [  0.496 s]
[INFO] Apache Falcon Messaging ........................... SUCCESS [ 25.910 s]
[INFO] Apache Falcon Oozie Adaptor ....................... SUCCESS [ 49.488 s]
[INFO] Apache Falcon Acquisition ......................... SUCCESS [  0.536 s]
[INFO] Apache Falcon Replication ......................... SUCCESS [ 17.114 s]
[INFO] Apache Falcon Retention ........................... SUCCESS [ 16.599 s]
[INFO] Apache Falcon Archival ............................ SUCCESS [  0.503 s]
[INFO] Apache Falcon Rerun ............................... SUCCESS [ 24.140 s]
[INFO] Apache Falcon Prism ............................... SUCCESS [ 55.954 s]
[INFO] Apache Falcon Web Application ..................... FAILURE [02:20 min]
[INFO] Apache Falcon Documentation ....................... SKIPPED
[INFO] ------------------------------------------------------------------------
[INFO] BUILD FAILURE
[INFO] ------------------------------------------------------------------------
[INFO] Total time: 09:09 min
[INFO] Finished at: 2015-01-12T02:09:20+00:00
[INFO] Final Memory: 109M/741M
[INFO] ------------------------------------------------------------------------
[ERROR] Failed to execute goal org.apache.maven.plugins:maven-failsafe-plugin:2.16:verify
(verify) on project falcon-webapp: There are test failures.
[ERROR] 
[ERROR] Please refer to <https://builds.apache.org/job/Apache-falcon/ws/webapp/target/failsafe-reports>
for the individual test results.
[ERROR] -> [Help 1]
[ERROR] 
[ERROR] To see the full stack trace of the errors, re-run Maven with the -e switch.
[ERROR] Re-run Maven using the -X switch to enable full debug logging.
[ERROR] 
[ERROR] For more information about the errors and possible solutions, please read the following
articles:
[ERROR] [Help 1] http://cwiki.apache.org/confluence/display/MAVEN/MojoFailureException
[ERROR] 
[ERROR] After correcting the problems, you can resume the build with the command
[ERROR]   mvn <goals> -rf :falcon-webapp
Shutting down hive metastore.
[INFO] Shutdown hook executing
[INFO] Shutdown hook complete
Build step 'Execute shell' marked build as failure
[CHECKSTYLE] Collecting checkstyle analysis files...
[CHECKSTYLE] Finding all files that match the pattern **/target/checkstyle-result.xml
[CHECKSTYLE] Parsing 26 files in <https://builds.apache.org/job/Apache-falcon/ws/>
[CHECKSTYLE] Successfully parsed file <https://builds.apache.org/job/Apache-falcon/ws/acquisition/target/checkstyle-result.xml>
of module  with 0 warnings.
[CHECKSTYLE] Successfully parsed file <https://builds.apache.org/job/Apache-falcon/ws/archival/target/checkstyle-result.xml>
of module  with 0 warnings.
[CHECKSTYLE] Successfully parsed file <https://builds.apache.org/job/Apache-falcon/ws/build-tools/target/checkstyle-result.xml>
of module  with 0 warnings.
[CHECKSTYLE] Successfully parsed file <https://builds.apache.org/job/Apache-falcon/ws/client/target/checkstyle-result.xml>
of module  with 0 warnings.
[CHECKSTYLE] Successfully parsed file <https://builds.apache.org/job/Apache-falcon/ws/common/target/checkstyle-result.xml>
of module  with 0 warnings.
[CHECKSTYLE] Successfully parsed file <https://builds.apache.org/job/Apache-falcon/ws/docs/target/checkstyle-result.xml>
of module  with 0 warnings.
[CHECKSTYLE] Successfully parsed file <https://builds.apache.org/job/Apache-falcon/ws/feed/target/checkstyle-result.xml>
of module  with 0 warnings.
[CHECKSTYLE] Successfully parsed file <https://builds.apache.org/job/Apache-falcon/ws/hadoop-dependencies/target/checkstyle-result.xml>
of module  with 0 warnings.
[CHECKSTYLE] Successfully parsed file <https://builds.apache.org/job/Apache-falcon/ws/hadoop-webapp/target/checkstyle-result.xml>
of module  with 0 warnings.
[CHECKSTYLE] Successfully parsed file <https://builds.apache.org/job/Apache-falcon/ws/messaging/target/checkstyle-result.xml>
of module  with 0 warnings.
[CHECKSTYLE] Successfully parsed file <https://builds.apache.org/job/Apache-falcon/ws/metrics/target/checkstyle-result.xml>
of module  with 0 warnings.
[CHECKSTYLE] Successfully parsed file <https://builds.apache.org/job/Apache-falcon/ws/oozie-el-extensions/target/checkstyle-result.xml>
of module  with 0 warnings.
[CHECKSTYLE] Successfully parsed file <https://builds.apache.org/job/Apache-falcon/ws/oozie/target/checkstyle-result.xml>
of module  with 0 warnings.
[CHECKSTYLE] Successfully parsed file <https://builds.apache.org/job/Apache-falcon/ws/prism/target/checkstyle-result.xml>
of module  with 0 warnings.
[CHECKSTYLE] Successfully parsed file <https://builds.apache.org/job/Apache-falcon/ws/process/target/checkstyle-result.xml>
of module  with 0 warnings.
[CHECKSTYLE] Successfully parsed file <https://builds.apache.org/job/Apache-falcon/ws/replication/target/checkstyle-result.xml>
of module  with 0 warnings.
[CHECKSTYLE] Successfully parsed file <https://builds.apache.org/job/Apache-falcon/ws/rerun/target/checkstyle-result.xml>
of module  with 0 warnings.
[CHECKSTYLE] Successfully parsed file <https://builds.apache.org/job/Apache-falcon/ws/retention/target/checkstyle-result.xml>
of module  with 0 warnings.
[CHECKSTYLE] Successfully parsed file <https://builds.apache.org/job/Apache-falcon/ws/target/checkstyle-result.xml>
of module  with 0 warnings.
[CHECKSTYLE] Successfully parsed file <https://builds.apache.org/job/Apache-falcon/ws/test-tools/hadoop-webapp/target/checkstyle-result.xml>
of module  with 0 warnings.
[CHECKSTYLE] Successfully parsed file <https://builds.apache.org/job/Apache-falcon/ws/test-tools/hcatalog-sharelib/target/checkstyle-result.xml>
of module  with 0 warnings.
[CHECKSTYLE] Successfully parsed file <https://builds.apache.org/job/Apache-falcon/ws/test-tools/hive-sharelib/target/checkstyle-result.xml>
of module  with 0 warnings.
[CHECKSTYLE] Successfully parsed file <https://builds.apache.org/job/Apache-falcon/ws/test-tools/oozie-sharelib/target/checkstyle-result.xml>
of module  with 0 warnings.
[CHECKSTYLE] Successfully parsed file <https://builds.apache.org/job/Apache-falcon/ws/test-tools/pig-sharelib/target/checkstyle-result.xml>
of module  with 0 warnings.
[CHECKSTYLE] Successfully parsed file <https://builds.apache.org/job/Apache-falcon/ws/test-tools/target/checkstyle-result.xml>
of module  with 0 warnings.
[CHECKSTYLE] Successfully parsed file <https://builds.apache.org/job/Apache-falcon/ws/test-util/target/checkstyle-result.xml>
of module  with 0 warnings.
[CHECKSTYLE] Computing warning deltas based on reference build #529
[FINDBUGS] Collecting findbugs analysis files...
[FINDBUGS] Finding all files that match the pattern **/target/findbugs.xml
[FINDBUGS] Parsing 16 files in <https://builds.apache.org/job/Apache-falcon/ws/>
[FINDBUGS] Successfully parsed file <https://builds.apache.org/job/Apache-falcon/ws/client/target/findbugs.xml>
of module  with 0 warnings.
[FINDBUGS] Successfully parsed file <https://builds.apache.org/job/Apache-falcon/ws/common/target/findbugs.xml>
of module  with 0 warnings.
[FINDBUGS] Successfully parsed file <https://builds.apache.org/job/Apache-falcon/ws/feed/target/findbugs.xml>
of module  with 0 warnings.
[FINDBUGS] Successfully parsed file <https://builds.apache.org/job/Apache-falcon/ws/hadoop-dependencies/target/findbugs.xml>
of module  with 0 warnings.
[FINDBUGS] Successfully parsed file <https://builds.apache.org/job/Apache-falcon/ws/hadoop-webapp/target/findbugs.xml>
of module  with 0 warnings.
[FINDBUGS] Successfully parsed file <https://builds.apache.org/job/Apache-falcon/ws/messaging/target/findbugs.xml>
of module  with 0 warnings.
[FINDBUGS] Successfully parsed file <https://builds.apache.org/job/Apache-falcon/ws/metrics/target/findbugs.xml>
of module  with 0 warnings.
[FINDBUGS] Successfully parsed file <https://builds.apache.org/job/Apache-falcon/ws/oozie-el-extensions/target/findbugs.xml>
of module  with 0 warnings.
[FINDBUGS] Successfully parsed file <https://builds.apache.org/job/Apache-falcon/ws/oozie/target/findbugs.xml>
of module  with 0 warnings.
[FINDBUGS] Successfully parsed file <https://builds.apache.org/job/Apache-falcon/ws/prism/target/findbugs.xml>
of module  with 0 warnings.
[FINDBUGS] Successfully parsed file <https://builds.apache.org/job/Apache-falcon/ws/process/target/findbugs.xml>
of module  with 0 warnings.
[FINDBUGS] Successfully parsed file <https://builds.apache.org/job/Apache-falcon/ws/replication/target/findbugs.xml>
of module  with 0 warnings.
[FINDBUGS] Successfully parsed file <https://builds.apache.org/job/Apache-falcon/ws/rerun/target/findbugs.xml>
of module  with 0 warnings.
[FINDBUGS] Successfully parsed file <https://builds.apache.org/job/Apache-falcon/ws/retention/target/findbugs.xml>
of module  with 0 warnings.
[FINDBUGS] Successfully parsed file <https://builds.apache.org/job/Apache-falcon/ws/test-tools/hadoop-webapp/target/findbugs.xml>
of module  with 0 warnings.
[FINDBUGS] Successfully parsed file <https://builds.apache.org/job/Apache-falcon/ws/test-util/target/findbugs.xml>
of module  with 0 warnings.
[FINDBUGS] Computing warning deltas based on reference build #529
Archiving artifacts
Sending artifact delta relative to Apache-falcon #529
Archived 16 artifacts
Archive block size is 32768
Received 0 blocks and 8597498 bytes
Compression is 0.0%
Took 2.2 sec
Recording test results
TestNG Reports Processing: START
Looking for TestNG results report in workspace using pattern: **/target/testng-results.xml
Did not find any matching files.

Mime
View raw message