falcon-dev mailing list archives

Site index · List index
Message view « Date » · « Thread »
Top « Date » · « Thread »
From Apache Jenkins Server <jenk...@builds.apache.org>
Subject Build failed in Jenkins: Apache-falcon #487
Date Fri, 05 Dec 2014 00:22:52 GMT
See <https://builds.apache.org/job/Apache-falcon/487/>

------------------------------------------
[...truncated 348 lines...]
	... 35 more
Caused by: java.net.ConnectException: Connection refused
	at java.net.PlainSocketImpl.socketConnect(Native Method)
	at java.net.AbstractPlainSocketImpl.doConnect(AbstractPlainSocketImpl.java:339)
	at java.net.AbstractPlainSocketImpl.connectToAddress(AbstractPlainSocketImpl.java:200)
	at java.net.AbstractPlainSocketImpl.connect(AbstractPlainSocketImpl.java:182)
	at java.net.SocksSocketImpl.connect(SocksSocketImpl.java:392)
	at java.net.Socket.connect(Socket.java:579)
	at org.tmatesoft.svn.core.internal.util.SVNSocketFactory.connect(SVNSocketFactory.java:146)
	at org.tmatesoft.svn.core.internal.util.SVNSocketFactory.createPlainSocket(SVNSocketFactory.java:73)
	at org.tmatesoft.svn.core.internal.io.dav.http.HTTPConnection.connect(HTTPConnection.java:280)
	at org.tmatesoft.svn.core.internal.io.dav.http.HTTPConnection._request(HTTPConnection.java:451)
	... 35 more
Retrying after 10 seconds
 > git rev-parse --is-inside-work-tree # timeout=10
Fetching changes from the remote Git repository
 > git config remote.origin.url https://git-wip-us.apache.org/repos/asf/incubator-falcon.git
# timeout=10
Fetching upstream changes from https://git-wip-us.apache.org/repos/asf/incubator-falcon.git
 > git --version # timeout=10
 > git fetch --tags --progress https://git-wip-us.apache.org/repos/asf/incubator-falcon.git
+refs/heads/*:refs/remotes/origin/*
Seen branch in repository origin/0.5
Seen branch in repository origin/FALCON-585
Seen branch in repository origin/FALCON-85
Seen branch in repository origin/FALCON-85-new
Seen branch in repository origin/branch-0.4
Seen branch in repository origin/branch-0.5
Seen branch in repository origin/branch-0.6
Seen branch in repository origin/designer
Seen branch in repository origin/master
Seen branch in repository origin/v0.3
Seen 10 remote branches
Checking out Revision 56900a2b860c257242e70bad7edbcd111528bfb3 (origin/master)
 > git config core.sparsecheckout # timeout=10
 > git checkout -f 56900a2b860c257242e70bad7edbcd111528bfb3
 > git rev-list 9520370a25eeb3621db9f48e72f40302993650dd # timeout=10
Updating http://svn.apache.org/repos/asf/hadoop/nightly at revision '2014-12-05T00:22:03.061
+0000'
ERROR: Failed to update http://svn.apache.org/repos/asf/hadoop/nightly
org.tmatesoft.svn.core.SVNException: svn: E175002: OPTIONS /repos/asf/hadoop/nightly failed
	at org.tmatesoft.svn.core.internal.io.dav.http.HTTPConnection.request(HTTPConnection.java:388)
	at org.tmatesoft.svn.core.internal.io.dav.http.HTTPConnection.request(HTTPConnection.java:373)
	at org.tmatesoft.svn.core.internal.io.dav.http.HTTPConnection.request(HTTPConnection.java:361)
	at org.tmatesoft.svn.core.internal.io.dav.DAVConnection.performHttpRequest(DAVConnection.java:707)
	at org.tmatesoft.svn.core.internal.io.dav.DAVConnection.exchangeCapabilities(DAVConnection.java:627)
	at org.tmatesoft.svn.core.internal.io.dav.DAVConnection.open(DAVConnection.java:102)
	at org.tmatesoft.svn.core.internal.io.dav.DAVRepository.openConnection(DAVRepository.java:1020)
	at org.tmatesoft.svn.core.internal.io.dav.DAVRepository.getRepositoryUUID(DAVRepository.java:148)
	at org.tmatesoft.svn.core.internal.wc16.SVNBasicDelegate.createRepository(SVNBasicDelegate.java:339)
	at org.tmatesoft.svn.core.internal.wc16.SVNBasicDelegate.createRepository(SVNBasicDelegate.java:328)
	at org.tmatesoft.svn.core.internal.wc16.SVNUpdateClient16.update(SVNUpdateClient16.java:482)
	at org.tmatesoft.svn.core.internal.wc16.SVNUpdateClient16.doUpdate(SVNUpdateClient16.java:364)
	at org.tmatesoft.svn.core.internal.wc16.SVNUpdateClient16.doUpdate(SVNUpdateClient16.java:274)
	at org.tmatesoft.svn.core.internal.wc2.old.SvnOldUpdate.run(SvnOldUpdate.java:27)
	at org.tmatesoft.svn.core.internal.wc2.old.SvnOldUpdate.run(SvnOldUpdate.java:11)
	at org.tmatesoft.svn.core.internal.wc2.SvnOperationRunner.run(SvnOperationRunner.java:20)
	at org.tmatesoft.svn.core.wc2.SvnOperationFactory.run(SvnOperationFactory.java:1238)
	at org.tmatesoft.svn.core.wc2.SvnOperation.run(SvnOperation.java:294)
	at org.tmatesoft.svn.core.wc.SVNUpdateClient.doUpdate(SVNUpdateClient.java:311)
	at org.tmatesoft.svn.core.wc.SVNUpdateClient.doUpdate(SVNUpdateClient.java:291)
	at org.tmatesoft.svn.core.wc.SVNUpdateClient.doUpdate(SVNUpdateClient.java:387)
	at hudson.scm.subversion.UpdateUpdater$TaskImpl.perform(UpdateUpdater.java:157)
	at hudson.scm.subversion.WorkspaceUpdater$UpdateTask.delegateTo(WorkspaceUpdater.java:161)
	at hudson.scm.SubversionSCM$CheckOutTask.perform(SubversionSCM.java:1030)
	at hudson.scm.SubversionSCM$CheckOutTask.invoke(SubversionSCM.java:1011)
	at hudson.scm.SubversionSCM$CheckOutTask.invoke(SubversionSCM.java:987)
	at hudson.FilePath$FileCallableWrapper.call(FilePath.java:2474)
	at hudson.remoting.UserRequest.perform(UserRequest.java:118)
	at hudson.remoting.UserRequest.perform(UserRequest.java:48)
	at hudson.remoting.Request$2.run(Request.java:328)
	at hudson.remoting.InterceptingExecutorService$1.call(InterceptingExecutorService.java:72)
	at java.util.concurrent.FutureTask.run(FutureTask.java:262)
	at java.util.concurrent.ThreadPoolExecutor.runWorker(ThreadPoolExecutor.java:1145)
	at java.util.concurrent.ThreadPoolExecutor$Worker.run(ThreadPoolExecutor.java:615)
	at java.lang.Thread.run(Thread.java:745)
Caused by: svn: E175002: OPTIONS /repos/asf/hadoop/nightly failed
	at org.tmatesoft.svn.core.SVNErrorMessage.create(SVNErrorMessage.java:208)
	at org.tmatesoft.svn.core.SVNErrorMessage.create(SVNErrorMessage.java:154)
	at org.tmatesoft.svn.core.SVNErrorMessage.create(SVNErrorMessage.java:97)
	... 35 more
Caused by: org.tmatesoft.svn.core.SVNException: svn: E175002: OPTIONS request failed on '/repos/asf/hadoop/nightly'
svn: E175002: connection refused by the server
	at org.tmatesoft.svn.core.internal.wc.SVNErrorManager.error(SVNErrorManager.java:64)
	at org.tmatesoft.svn.core.internal.wc.SVNErrorManager.error(SVNErrorManager.java:51)
	at org.tmatesoft.svn.core.internal.io.dav.http.HTTPConnection._request(HTTPConnection.java:777)
	at org.tmatesoft.svn.core.internal.io.dav.http.HTTPConnection.request(HTTPConnection.java:382)
	... 34 more
Caused by: svn: E175002: OPTIONS request failed on '/repos/asf/hadoop/nightly'
	at org.tmatesoft.svn.core.SVNErrorMessage.create(SVNErrorMessage.java:208)
	at org.tmatesoft.svn.core.internal.io.dav.http.HTTPConnection._request(HTTPConnection.java:775)
	... 35 more
Caused by: svn: E175002: connection refused by the server
	at org.tmatesoft.svn.core.SVNErrorMessage.create(SVNErrorMessage.java:208)
	at org.tmatesoft.svn.core.internal.io.dav.http.HTTPConnection._request(HTTPConnection.java:520)
	... 35 more
Caused by: java.net.ConnectException: Connection refused
	at java.net.PlainSocketImpl.socketConnect(Native Method)
	at java.net.AbstractPlainSocketImpl.doConnect(AbstractPlainSocketImpl.java:339)
	at java.net.AbstractPlainSocketImpl.connectToAddress(AbstractPlainSocketImpl.java:200)
	at java.net.AbstractPlainSocketImpl.connect(AbstractPlainSocketImpl.java:182)
	at java.net.SocksSocketImpl.connect(SocksSocketImpl.java:392)
	at java.net.Socket.connect(Socket.java:579)
	at org.tmatesoft.svn.core.internal.util.SVNSocketFactory.connect(SVNSocketFactory.java:146)
	at org.tmatesoft.svn.core.internal.util.SVNSocketFactory.createPlainSocket(SVNSocketFactory.java:73)
	at org.tmatesoft.svn.core.internal.io.dav.http.HTTPConnection.connect(HTTPConnection.java:280)
	at org.tmatesoft.svn.core.internal.io.dav.http.HTTPConnection._request(HTTPConnection.java:451)
	... 35 more
ERROR: Subversion update failed
java.io.IOException: remote file operation failed: <https://builds.apache.org/job/Apache-falcon/ws/>
at hudson.remoting.Channel@2e0fc66f:H0
	at hudson.FilePath.act(FilePath.java:916)
	at hudson.FilePath.act(FilePath.java:893)
	at hudson.scm.SubversionSCM.checkout(SubversionSCM.java:936)
	at hudson.scm.SubversionSCM.checkout(SubversionSCM.java:871)
	at org.jenkinsci.plugins.multiplescms.MultiSCM.checkout(MultiSCM.java:118)
	at hudson.model.AbstractProject.checkout(AbstractProject.java:1252)
	at hudson.model.AbstractBuild$AbstractBuildExecution.defaultCheckout(AbstractBuild.java:615)
	at jenkins.scm.SCMCheckoutStrategy.checkout(SCMCheckoutStrategy.java:86)
	at hudson.model.AbstractBuild$AbstractBuildExecution.run(AbstractBuild.java:524)
	at hudson.model.Run.execute(Run.java:1706)
	at hudson.model.FreeStyleBuild.run(FreeStyleBuild.java:43)
	at hudson.model.ResourceController.execute(ResourceController.java:88)
	at hudson.model.Executor.run(Executor.java:232)
Caused by: java.io.IOException
	at hudson.scm.subversion.UpdateUpdater$TaskImpl.perform(UpdateUpdater.java:211)
	at hudson.scm.subversion.WorkspaceUpdater$UpdateTask.delegateTo(WorkspaceUpdater.java:161)
	at hudson.scm.SubversionSCM$CheckOutTask.perform(SubversionSCM.java:1030)
	at hudson.scm.SubversionSCM$CheckOutTask.invoke(SubversionSCM.java:1011)
	at hudson.scm.SubversionSCM$CheckOutTask.invoke(SubversionSCM.java:987)
	at hudson.FilePath$FileCallableWrapper.call(FilePath.java:2474)
	at hudson.remoting.UserRequest.perform(UserRequest.java:118)
	at hudson.remoting.UserRequest.perform(UserRequest.java:48)
	at hudson.remoting.Request$2.run(Request.java:328)
	at hudson.remoting.InterceptingExecutorService$1.call(InterceptingExecutorService.java:72)
	at java.util.concurrent.FutureTask.run(FutureTask.java:262)
	at java.util.concurrent.ThreadPoolExecutor.runWorker(ThreadPoolExecutor.java:1145)
	at java.util.concurrent.ThreadPoolExecutor$Worker.run(ThreadPoolExecutor.java:615)
	at java.lang.Thread.run(Thread.java:745)
Caused by: hudson.scm.subversion.UpdaterException: failed to perform svn update
	... 14 more
Caused by: org.tmatesoft.svn.core.SVNException: svn: E175002: OPTIONS /repos/asf/hadoop/nightly
failed
	at org.tmatesoft.svn.core.internal.io.dav.http.HTTPConnection.request(HTTPConnection.java:388)
	at org.tmatesoft.svn.core.internal.io.dav.http.HTTPConnection.request(HTTPConnection.java:373)
	at org.tmatesoft.svn.core.internal.io.dav.http.HTTPConnection.request(HTTPConnection.java:361)
	at org.tmatesoft.svn.core.internal.io.dav.DAVConnection.performHttpRequest(DAVConnection.java:707)
	at org.tmatesoft.svn.core.internal.io.dav.DAVConnection.exchangeCapabilities(DAVConnection.java:627)
	at org.tmatesoft.svn.core.internal.io.dav.DAVConnection.open(DAVConnection.java:102)
	at org.tmatesoft.svn.core.internal.io.dav.DAVRepository.openConnection(DAVRepository.java:1020)
	at org.tmatesoft.svn.core.internal.io.dav.DAVRepository.getRepositoryUUID(DAVRepository.java:148)
	at org.tmatesoft.svn.core.internal.wc16.SVNBasicDelegate.createRepository(SVNBasicDelegate.java:339)
	at org.tmatesoft.svn.core.internal.wc16.SVNBasicDelegate.createRepository(SVNBasicDelegate.java:328)
	at org.tmatesoft.svn.core.internal.wc16.SVNUpdateClient16.update(SVNUpdateClient16.java:482)
	at org.tmatesoft.svn.core.internal.wc16.SVNUpdateClient16.doUpdate(SVNUpdateClient16.java:364)
	at org.tmatesoft.svn.core.internal.wc16.SVNUpdateClient16.doUpdate(SVNUpdateClient16.java:274)
	at org.tmatesoft.svn.core.internal.wc2.old.SvnOldUpdate.run(SvnOldUpdate.java:27)
	at org.tmatesoft.svn.core.internal.wc2.old.SvnOldUpdate.run(SvnOldUpdate.java:11)
	at org.tmatesoft.svn.core.internal.wc2.SvnOperationRunner.run(SvnOperationRunner.java:20)
	at org.tmatesoft.svn.core.wc2.SvnOperationFactory.run(SvnOperationFactory.java:1238)
	at org.tmatesoft.svn.core.wc2.SvnOperation.run(SvnOperation.java:294)
	at org.tmatesoft.svn.core.wc.SVNUpdateClient.doUpdate(SVNUpdateClient.java:311)
	at org.tmatesoft.svn.core.wc.SVNUpdateClient.doUpdate(SVNUpdateClient.java:291)
	at org.tmatesoft.svn.core.wc.SVNUpdateClient.doUpdate(SVNUpdateClient.java:387)
	at hudson.scm.subversion.UpdateUpdater$TaskImpl.perform(UpdateUpdater.java:157)
	... 13 more
Caused by: svn: E175002: OPTIONS /repos/asf/hadoop/nightly failed
	at org.tmatesoft.svn.core.SVNErrorMessage.create(SVNErrorMessage.java:208)
	at org.tmatesoft.svn.core.SVNErrorMessage.create(SVNErrorMessage.java:154)
	at org.tmatesoft.svn.core.SVNErrorMessage.create(SVNErrorMessage.java:97)
	... 35 more
Caused by: org.tmatesoft.svn.core.SVNException: svn: E175002: OPTIONS request failed on '/repos/asf/hadoop/nightly'
svn: E175002: connection refused by the server
	at org.tmatesoft.svn.core.internal.wc.SVNErrorManager.error(SVNErrorManager.java:64)
	at org.tmatesoft.svn.core.internal.wc.SVNErrorManager.error(SVNErrorManager.java:51)
	at org.tmatesoft.svn.core.internal.io.dav.http.HTTPConnection._request(HTTPConnection.java:777)
	at org.tmatesoft.svn.core.internal.io.dav.http.HTTPConnection.request(HTTPConnection.java:382)
	... 34 more
Caused by: svn: E175002: OPTIONS request failed on '/repos/asf/hadoop/nightly'
	at org.tmatesoft.svn.core.SVNErrorMessage.create(SVNErrorMessage.java:208)
	at org.tmatesoft.svn.core.internal.io.dav.http.HTTPConnection._request(HTTPConnection.java:775)
	... 35 more
Caused by: svn: E175002: connection refused by the server
	at org.tmatesoft.svn.core.SVNErrorMessage.create(SVNErrorMessage.java:208)
	at org.tmatesoft.svn.core.internal.io.dav.http.HTTPConnection._request(HTTPConnection.java:520)
	... 35 more
Caused by: java.net.ConnectException: Connection refused
	at java.net.PlainSocketImpl.socketConnect(Native Method)
	at java.net.AbstractPlainSocketImpl.doConnect(AbstractPlainSocketImpl.java:339)
	at java.net.AbstractPlainSocketImpl.connectToAddress(AbstractPlainSocketImpl.java:200)
	at java.net.AbstractPlainSocketImpl.connect(AbstractPlainSocketImpl.java:182)
	at java.net.SocksSocketImpl.connect(SocksSocketImpl.java:392)
	at java.net.Socket.connect(Socket.java:579)
	at org.tmatesoft.svn.core.internal.util.SVNSocketFactory.connect(SVNSocketFactory.java:146)
	at org.tmatesoft.svn.core.internal.util.SVNSocketFactory.createPlainSocket(SVNSocketFactory.java:73)
	at org.tmatesoft.svn.core.internal.io.dav.http.HTTPConnection.connect(HTTPConnection.java:280)
	at org.tmatesoft.svn.core.internal.io.dav.http.HTTPConnection._request(HTTPConnection.java:451)
	... 35 more
[CHECKSTYLE] Collecting checkstyle analysis files...
[CHECKSTYLE] Finding all files that match the pattern **/target/checkstyle-result.xml
[CHECKSTYLE] Parsing 21 files in <https://builds.apache.org/job/Apache-falcon/ws/>
[CHECKSTYLE] Successfully parsed file <https://builds.apache.org/job/Apache-falcon/ws/acquisition/target/checkstyle-result.xml>
of module  with 0 warnings.
[CHECKSTYLE] Successfully parsed file <https://builds.apache.org/job/Apache-falcon/ws/archival/target/checkstyle-result.xml>
of module  with 0 warnings.
[CHECKSTYLE] Successfully parsed file <https://builds.apache.org/job/Apache-falcon/ws/build-tools/target/checkstyle-result.xml>
of module  with 0 warnings.
[CHECKSTYLE] Successfully parsed file <https://builds.apache.org/job/Apache-falcon/ws/client/target/checkstyle-result.xml>
of module  with 0 warnings.
[CHECKSTYLE] Successfully parsed file <https://builds.apache.org/job/Apache-falcon/ws/common/target/checkstyle-result.xml>
of module  with 0 warnings.
[CHECKSTYLE] Successfully parsed file <https://builds.apache.org/job/Apache-falcon/ws/docs/target/checkstyle-result.xml>
of module  with 0 warnings.
[CHECKSTYLE] Successfully parsed file <https://builds.apache.org/job/Apache-falcon/ws/feed/target/checkstyle-result.xml>
of module  with 0 warnings.
[CHECKSTYLE] Successfully parsed file <https://builds.apache.org/job/Apache-falcon/ws/hadoop-dependencies/target/checkstyle-result.xml>
of module  with 0 warnings.
[CHECKSTYLE] Successfully parsed file <https://builds.apache.org/job/Apache-falcon/ws/hadoop-webapp/target/checkstyle-result.xml>
of module  with 0 warnings.
[CHECKSTYLE] Successfully parsed file <https://builds.apache.org/job/Apache-falcon/ws/messaging/target/checkstyle-result.xml>
of module  with 0 warnings.
[CHECKSTYLE] Successfully parsed file <https://builds.apache.org/job/Apache-falcon/ws/metrics/target/checkstyle-result.xml>
of module  with 0 warnings.
[CHECKSTYLE] Successfully parsed file <https://builds.apache.org/job/Apache-falcon/ws/oozie-el-extensions/target/checkstyle-result.xml>
of module  with 0 warnings.
[CHECKSTYLE] Successfully parsed file <https://builds.apache.org/job/Apache-falcon/ws/oozie/target/checkstyle-result.xml>
of module  with 0 warnings.
[CHECKSTYLE] Successfully parsed file <https://builds.apache.org/job/Apache-falcon/ws/prism/target/checkstyle-result.xml>
of module  with 0 warnings.
[CHECKSTYLE] Successfully parsed file <https://builds.apache.org/job/Apache-falcon/ws/process/target/checkstyle-result.xml>
of module  with 0 warnings.
[CHECKSTYLE] Successfully parsed file <https://builds.apache.org/job/Apache-falcon/ws/replication/target/checkstyle-result.xml>
of module  with 0 warnings.
[CHECKSTYLE] Successfully parsed file <https://builds.apache.org/job/Apache-falcon/ws/rerun/target/checkstyle-result.xml>
of module  with 0 warnings.
[CHECKSTYLE] Successfully parsed file <https://builds.apache.org/job/Apache-falcon/ws/retention/target/checkstyle-result.xml>
of module  with 0 warnings.
[CHECKSTYLE] Successfully parsed file <https://builds.apache.org/job/Apache-falcon/ws/target/checkstyle-result.xml>
of module  with 0 warnings.
[CHECKSTYLE] Successfully parsed file <https://builds.apache.org/job/Apache-falcon/ws/test-util/target/checkstyle-result.xml>
of module  with 0 warnings.
[CHECKSTYLE] Successfully parsed file <https://builds.apache.org/job/Apache-falcon/ws/webapp/target/checkstyle-result.xml>
of module  with 0 warnings.
[CHECKSTYLE] Computing warning deltas based on reference build #485
[FINDBUGS] Collecting findbugs analysis files...
[FINDBUGS] Finding all files that match the pattern **/target/findbugs.xml
[FINDBUGS] Parsing 16 files in <https://builds.apache.org/job/Apache-falcon/ws/>
[FINDBUGS] Successfully parsed file <https://builds.apache.org/job/Apache-falcon/ws/client/target/findbugs.xml>
of module  with 0 warnings.
[FINDBUGS] Successfully parsed file <https://builds.apache.org/job/Apache-falcon/ws/common/target/findbugs.xml>
of module  with 0 warnings.
[FINDBUGS] Successfully parsed file <https://builds.apache.org/job/Apache-falcon/ws/feed/target/findbugs.xml>
of module  with 0 warnings.
[FINDBUGS] Successfully parsed file <https://builds.apache.org/job/Apache-falcon/ws/hadoop-dependencies/target/findbugs.xml>
of module  with 0 warnings.
[FINDBUGS] Successfully parsed file <https://builds.apache.org/job/Apache-falcon/ws/hadoop-webapp/target/findbugs.xml>
of module  with 0 warnings.
[FINDBUGS] Successfully parsed file <https://builds.apache.org/job/Apache-falcon/ws/messaging/target/findbugs.xml>
of module  with 0 warnings.
[FINDBUGS] Successfully parsed file <https://builds.apache.org/job/Apache-falcon/ws/metrics/target/findbugs.xml>
of module  with 0 warnings.
[FINDBUGS] Successfully parsed file <https://builds.apache.org/job/Apache-falcon/ws/oozie-el-extensions/target/findbugs.xml>
of module  with 0 warnings.
[FINDBUGS] Successfully parsed file <https://builds.apache.org/job/Apache-falcon/ws/oozie/target/findbugs.xml>
of module  with 0 warnings.
[FINDBUGS] Successfully parsed file <https://builds.apache.org/job/Apache-falcon/ws/prism/target/findbugs.xml>
of module  with 0 warnings.
[FINDBUGS] Successfully parsed file <https://builds.apache.org/job/Apache-falcon/ws/process/target/findbugs.xml>
of module  with 0 warnings.
[FINDBUGS] Successfully parsed file <https://builds.apache.org/job/Apache-falcon/ws/replication/target/findbugs.xml>
of module  with 0 warnings.
[FINDBUGS] Successfully parsed file <https://builds.apache.org/job/Apache-falcon/ws/rerun/target/findbugs.xml>
of module  with 0 warnings.
[FINDBUGS] Successfully parsed file <https://builds.apache.org/job/Apache-falcon/ws/retention/target/findbugs.xml>
of module  with 0 warnings.
[FINDBUGS] Successfully parsed file <https://builds.apache.org/job/Apache-falcon/ws/test-util/target/findbugs.xml>
of module  with 0 warnings.
[FINDBUGS] Successfully parsed file <https://builds.apache.org/job/Apache-falcon/ws/webapp/target/findbugs.xml>
of module  with 0 warnings.
[FINDBUGS] Computing warning deltas based on reference build #485
Archiving artifacts
Sending artifact delta relative to Apache-falcon #485
Archived 16 artifacts
Archive block size is 32768
Received 374 blocks and 15886 bytes
Compression is 99.9%
Took 3 sec
Recording test results
TestNG Reports Processing: START
Looking for TestNG results report in workspace using pattern: **/target/testng-results.xml
Did not find any matching files.

Mime
View raw message