falcon-dev mailing list archives

Site index · List index
Message view « Date » · « Thread »
Top « Date » · « Thread »
From Apache Jenkins Server <jenk...@builds.apache.org>
Subject Build failed in Jenkins: Apache-falcon #467
Date Sun, 16 Nov 2014 00:23:10 GMT
See <https://builds.apache.org/job/Apache-falcon/467/>

------------------------------------------
[...truncated 31 lines...]
++ JAVA_HOME=/home/jenkins/tools/java/latest
++ export ANT_HOME=/home/jenkins/tools/ant/latest
++ ANT_HOME=/home/jenkins/tools/ant/latest
++ export FORREST_HOME=/home/jenkins/tools/forrest/latest
++ FORREST_HOME=/home/jenkins/tools/forrest/latest
++ export JAVA5_HOME=/home/jenkins/tools/java/latest1.5
++ JAVA5_HOME=/home/jenkins/tools/java/latest1.5
++ export FINDBUGS_HOME=/home/jenkins/tools/findbugs/latest
++ FINDBUGS_HOME=/home/jenkins/tools/findbugs/latest
++ export CLOVER_HOME=/home/jenkins/tools/clover/latest
++ CLOVER_HOME=/home/jenkins/tools/clover/latest
++ export MAVEN_HOME=/home/jenkins/tools/maven/latest
++ MAVEN_HOME=/home/jenkins/tools/maven/latest
++ export PATH=/home/jenkins/tools/java/latest1.6/bin:/home/jenkins/tools/java/latest1.6/bin:/usr/local/sbin:/usr/local/bin:/usr/sbin:/usr/bin:/sbin:/bin:/usr/games:/usr/local/games:/home/jenkins/tools/java/latest/bin:/home/jenkins/tools/ant/latest/bin:
++ PATH=/home/jenkins/tools/java/latest1.6/bin:/home/jenkins/tools/java/latest1.6/bin:/usr/local/sbin:/usr/local/bin:/usr/sbin:/usr/bin:/sbin:/bin:/usr/games:/usr/local/games:/home/jenkins/tools/java/latest/bin:/home/jenkins/tools/ant/latest/bin:
++ export ANT_OPTS=-Xmx2048m
++ ANT_OPTS=-Xmx2048m
++ export MAVEN_OPTS=-Xmx2048m
++ MAVEN_OPTS=-Xmx2048m
++ TRUNK=<https://builds.apache.org/job/Apache-falcon/ws/trunk>
++ ulimit -n
60000
+ export 'MAVEN_OPTS=-Xmx1024m -XX:MaxPermSize=256m'
+ MAVEN_OPTS='-Xmx1024m -XX:MaxPermSize=256m'
+ /home/jenkins/tools/maven/latest/bin/mvn clean verify -P test-patch,hadoop-2 -Drat.numUnapprovedLicenses=100
[INFO] Scanning for projects...
[WARNING] 
[WARNING] Some problems were encountered while building the effective model for org.apache.falcon:falcon-oozie-adaptor:jar:0.6-incubating
[WARNING] 'build.plugins.plugin.version' for org.jvnet.jaxb2.maven2:maven-jaxb2-plugin is
missing. @ line 108, column 21
[WARNING] 
[WARNING] Some problems were encountered while building the effective model for org.apache.falcon:falcon-prism:war:0.6-incubating
[WARNING] 'build.plugins.plugin.version' for org.codehaus.mojo:keytool-maven-plugin is missing.
@ line 159, column 21
[WARNING] 
[WARNING] Some problems were encountered while building the effective model for org.apache.falcon:falcon-webapp:war:0.6-incubating
[WARNING] 'build.plugins.plugin.(groupId:artifactId)' must be unique but found duplicate declaration
of plugin org.apache.maven.plugins:maven-dependency-plugin @ line 360, column 21
[WARNING] 
[WARNING] It is highly recommended to fix these problems because they threaten the stability
of your build.
[WARNING] 
[WARNING] For this reason, future Maven versions might no longer support building such malformed
projects.
[WARNING] 
[INFO] ------------------------------------------------------------------------
[INFO] Reactor Build Order:
[INFO] 
[INFO] Checkstyle
[INFO] Apache Falcon
[INFO] Build Tools
[INFO] Apache Falcon CLI client
[INFO] Apache Falcon Metrics
[INFO] Apache Falcon Hadoop Dependencies
[INFO] Apache Falcon Test Utility
[INFO] Apache Falcon Commons
[INFO] Apache Falcon Oozie EL Extension
[INFO] Apache Falcon Embedded Hadoop - Test Cluster
[INFO] Apache Falcon Messaging
[INFO] Apache Falcon Oozie Adaptor
[INFO] Apache Falcon Acquisition
[INFO] Apache Falcon Replication
[INFO] Apache Falcon Retention
[INFO] Apache Falcon Archival
[INFO] Apache Falcon Rerun
[INFO] Apache Falcon Prism
[INFO] Apache Falcon Web Application
[INFO] Apache Falcon Documentation
[INFO] 
[INFO] Using the builder org.apache.maven.lifecycle.internal.builder.singlethreaded.SingleThreadedBuilder
with a thread count of 1
[INFO]                                                                         
[INFO] ------------------------------------------------------------------------
[INFO] Building Checkstyle 0.6-incubating-SNAPSHOT
[INFO] ------------------------------------------------------------------------
[INFO] 
[INFO] --- maven-clean-plugin:2.5:clean (default-clean) @ checkstyle ---
[INFO] Deleting <https://builds.apache.org/job/Apache-falcon/ws/checkstyle/target>
[INFO] 
[INFO] --- maven-resources-plugin:2.6:resources (default-resources) @ checkstyle ---
[WARNING] Using platform encoding (ISO-8859-1 actually) to copy filtered resources, i.e. build
is platform dependent!
[INFO] Copying 4 resources
[INFO] 
[INFO] --- maven-compiler-plugin:2.5.1:compile (default-compile) @ checkstyle ---
[INFO] No sources to compile
[INFO] 
[INFO] --- maven-resources-plugin:2.6:testResources (default-testResources) @ checkstyle ---
[WARNING] Using platform encoding (ISO-8859-1 actually) to copy filtered resources, i.e. build
is platform dependent!
[INFO] skip non existing resourceDirectory <https://builds.apache.org/job/Apache-falcon/ws/checkstyle/src/test/resources>
[INFO] 
[INFO] --- maven-compiler-plugin:2.5.1:testCompile (default-testCompile) @ checkstyle ---
[INFO] No sources to compile
[INFO] 
[INFO] --- maven-surefire-plugin:2.12.4:test (default-test) @ checkstyle ---
[INFO] No tests to run.
[INFO] 
[INFO] --- maven-jar-plugin:2.4:jar (default-jar) @ checkstyle ---
[INFO] Building jar: <https://builds.apache.org/job/Apache-falcon/ws/checkstyle/target/checkstyle-0.6-incubating-SNAPSHOT.jar>
[INFO]                                                                         
[INFO] ------------------------------------------------------------------------
[INFO] Building Apache Falcon 0.6-incubating
[INFO] ------------------------------------------------------------------------
[INFO] 
[INFO] --- maven-clean-plugin:2.5:clean (default-clean) @ falcon-main ---
[INFO] Deleting <https://builds.apache.org/job/Apache-falcon/ws/target>
[INFO] 
[INFO] --- maven-enforcer-plugin:1.3.1:enforce (enforce-property) @ falcon-main ---
[INFO] 
[INFO] --- buildnumber-maven-plugin:1.0:create (default) @ falcon-main ---
[INFO] Checking for local modifications: skipped.
[INFO] Updating project files from SCM: skipped.
[INFO] Executing: /bin/sh -c cd <https://builds.apache.org/job/Apache-falcon/ws/> &&
git show
[INFO] Working directory: <https://builds.apache.org/job/Apache-falcon/ws/>
[INFO] Storing buildNumber: 388686fc9de89e30c92b38bf4b49d047665c429c at timestamp: 1416097375734
[INFO] Executing: /bin/sh -c cd <https://builds.apache.org/job/Apache-falcon/ws/> &&
git show
[INFO] Working directory: <https://builds.apache.org/job/Apache-falcon/ws/>
[INFO] Storing buildScmBranch: UNKNOWN
[INFO] 
[INFO] --- maven-remote-resources-plugin:1.4:process (default) @ falcon-main ---
[INFO] 
[INFO] --- maven-site-plugin:3.2:site (default) @ falcon-main ---
[INFO] maven.site.skip = true: Skipping site generation
[INFO] 
[INFO] --- maven-site-plugin:3.2:attach-descriptor (attach-descriptor) @ falcon-main ---
[INFO] 
[INFO] --- maven-failsafe-plugin:2.16:integration-test (integration-test) @ falcon-main ---
[INFO] No tests to run.
[INFO] 
[INFO] --- maven-failsafe-plugin:2.16:verify (verify) @ falcon-main ---
[INFO] No tests to run.
[INFO] 
[INFO] --- apache-rat-plugin:0.7:check (rat-check) @ falcon-main ---
[INFO] Exclude: *.txt
[INFO] Exclude: **/*.txt
[INFO] Exclude: .git/**
[INFO] Exclude: **/.idea/**
[INFO] Exclude: **/*.twiki
[INFO] Exclude: **/*.iml
[INFO] Exclude: **/target/**
[INFO] Exclude: **/activemq-data/**
[INFO] Exclude: **/build/**
[INFO] Exclude: **/*.patch
[INFO] Exclude: derby.log
[INFO] Exclude: **/logs/**
[INFO] Exclude: **/.classpath
[INFO] Exclude: **/.project
[INFO] Exclude: **/.settings/**
[INFO] Exclude: **/test-output/**
[INFO] Exclude: **/data.txt
[INFO] Exclude: **/maven-eclipse.xml
[INFO] Exclude: **/.externalToolBuilders/**
[INFO] Exclude: html5-ui/**
[INFO] 
[INFO] --- maven-checkstyle-plugin:2.9.1:check (checkstyle-check) @ falcon-main ---
Downloading: http://repo.maven.apache.org/maven2/org/apache/falcon/checkstyle/0.6-incubating/checkstyle-0.6-incubating.pom

[WARNING] The POM for org.apache.falcon:checkstyle:jar:0.6-incubating is missing, no dependency
information available
Downloading: http://repo.maven.apache.org/maven2/org/apache/falcon/checkstyle/0.6-incubating/checkstyle-0.6-incubating.jar

[INFO] ------------------------------------------------------------------------
[INFO] Reactor Summary:
[INFO] 
[INFO] Checkstyle ........................................ SUCCESS [  1.020 s]
[INFO] Apache Falcon ..................................... FAILURE [  4.302 s]
[INFO] Build Tools ....................................... SKIPPED
[INFO] Apache Falcon CLI client .......................... SKIPPED
[INFO] Apache Falcon Metrics ............................. SKIPPED
[INFO] Apache Falcon Hadoop Dependencies ................. SKIPPED
[INFO] Apache Falcon Test Utility ........................ SKIPPED
[INFO] Apache Falcon Commons ............................. SKIPPED
[INFO] Apache Falcon Oozie EL Extension .................. SKIPPED
[INFO] Apache Falcon Embedded Hadoop - Test Cluster ...... SKIPPED
[INFO] Apache Falcon Messaging ........................... SKIPPED
[INFO] Apache Falcon Oozie Adaptor ....................... SKIPPED
[INFO] Apache Falcon Acquisition ......................... SKIPPED
[INFO] Apache Falcon Replication ......................... SKIPPED
[INFO] Apache Falcon Retention ........................... SKIPPED
[INFO] Apache Falcon Archival ............................ SKIPPED
[INFO] Apache Falcon Rerun ............................... SKIPPED
[INFO] Apache Falcon Prism ............................... SKIPPED
[INFO] Apache Falcon Web Application ..................... SKIPPED
[INFO] Apache Falcon Documentation ....................... SKIPPED
[INFO] ------------------------------------------------------------------------
[INFO] BUILD FAILURE
[INFO] ------------------------------------------------------------------------
[INFO] Total time: 5.953 s
[INFO] Finished at: 2014-11-16T00:22:59+00:00
[INFO] Final Memory: 27M/813M
[INFO] ------------------------------------------------------------------------
[ERROR] Failed to execute goal org.apache.maven.plugins:maven-checkstyle-plugin:2.9.1:check
(checkstyle-check) on project falcon-main: Execution checkstyle-check of goal org.apache.maven.plugins:maven-checkstyle-plugin:2.9.1:check
failed: Plugin org.apache.maven.plugins:maven-checkstyle-plugin:2.9.1 or one of its dependencies
could not be resolved: Could not find artifact org.apache.falcon:checkstyle:jar:0.6-incubating
in central (http://repo.maven.apache.org/maven2) -> [Help 1]
[ERROR] 
[ERROR] To see the full stack trace of the errors, re-run Maven with the -e switch.
[ERROR] Re-run Maven using the -X switch to enable full debug logging.
[ERROR] 
[ERROR] For more information about the errors and possible solutions, please read the following
articles:
[ERROR] [Help 1] http://cwiki.apache.org/confluence/display/MAVEN/PluginResolutionException
[ERROR] 
[ERROR] After correcting the problems, you can resume the build with the command
[ERROR]   mvn <goals> -rf :falcon-main
Build step 'Execute shell' marked build as failure
[CHECKSTYLE] Collecting checkstyle analysis files...
[CHECKSTYLE] Finding all files that match the pattern **/target/checkstyle-result.xml
[CHECKSTYLE] Parsing 20 files in <https://builds.apache.org/job/Apache-falcon/ws/>
[CHECKSTYLE] Successfully parsed file <https://builds.apache.org/job/Apache-falcon/ws/acquisition/target/checkstyle-result.xml>
of module  with 0 warnings.
[CHECKSTYLE] Successfully parsed file <https://builds.apache.org/job/Apache-falcon/ws/archival/target/checkstyle-result.xml>
of module  with 0 warnings.
[CHECKSTYLE] Successfully parsed file <https://builds.apache.org/job/Apache-falcon/ws/build-tools/target/checkstyle-result.xml>
of module  with 0 warnings.
[CHECKSTYLE] Successfully parsed file <https://builds.apache.org/job/Apache-falcon/ws/client/target/checkstyle-result.xml>
of module  with 0 warnings.
[CHECKSTYLE] Successfully parsed file <https://builds.apache.org/job/Apache-falcon/ws/common/target/checkstyle-result.xml>
of module  with 0 warnings.
[CHECKSTYLE] Successfully parsed file <https://builds.apache.org/job/Apache-falcon/ws/docs/target/checkstyle-result.xml>
of module  with 0 warnings.
[CHECKSTYLE] Successfully parsed file <https://builds.apache.org/job/Apache-falcon/ws/feed/target/checkstyle-result.xml>
of module  with 0 warnings.
[CHECKSTYLE] Successfully parsed file <https://builds.apache.org/job/Apache-falcon/ws/hadoop-dependencies/target/checkstyle-result.xml>
of module  with 0 warnings.
[CHECKSTYLE] Successfully parsed file <https://builds.apache.org/job/Apache-falcon/ws/hadoop-webapp/target/checkstyle-result.xml>
of module  with 0 warnings.
[CHECKSTYLE] Successfully parsed file <https://builds.apache.org/job/Apache-falcon/ws/messaging/target/checkstyle-result.xml>
of module  with 0 warnings.
[CHECKSTYLE] Successfully parsed file <https://builds.apache.org/job/Apache-falcon/ws/metrics/target/checkstyle-result.xml>
of module  with 0 warnings.
[CHECKSTYLE] Successfully parsed file <https://builds.apache.org/job/Apache-falcon/ws/oozie-el-extensions/target/checkstyle-result.xml>
of module  with 0 warnings.
[CHECKSTYLE] Successfully parsed file <https://builds.apache.org/job/Apache-falcon/ws/oozie/target/checkstyle-result.xml>
of module  with 0 warnings.
[CHECKSTYLE] Successfully parsed file <https://builds.apache.org/job/Apache-falcon/ws/prism/target/checkstyle-result.xml>
of module  with 0 warnings.
[CHECKSTYLE] Successfully parsed file <https://builds.apache.org/job/Apache-falcon/ws/process/target/checkstyle-result.xml>
of module  with 0 warnings.
[CHECKSTYLE] Successfully parsed file <https://builds.apache.org/job/Apache-falcon/ws/replication/target/checkstyle-result.xml>
of module  with 0 warnings.
[CHECKSTYLE] Successfully parsed file <https://builds.apache.org/job/Apache-falcon/ws/rerun/target/checkstyle-result.xml>
of module  with 0 warnings.
[CHECKSTYLE] Successfully parsed file <https://builds.apache.org/job/Apache-falcon/ws/retention/target/checkstyle-result.xml>
of module  with 0 warnings.
[CHECKSTYLE] Successfully parsed file <https://builds.apache.org/job/Apache-falcon/ws/test-util/target/checkstyle-result.xml>
of module  with 0 warnings.
[CHECKSTYLE] Successfully parsed file <https://builds.apache.org/job/Apache-falcon/ws/webapp/target/checkstyle-result.xml>
of module  with 0 warnings.
[CHECKSTYLE] Computing warning deltas based on reference build #465
[FINDBUGS] Collecting findbugs analysis files...
[FINDBUGS] Finding all files that match the pattern **/target/findbugs.xml
[FINDBUGS] Parsing 16 files in <https://builds.apache.org/job/Apache-falcon/ws/>
[FINDBUGS] Successfully parsed file <https://builds.apache.org/job/Apache-falcon/ws/client/target/findbugs.xml>
of module  with 0 warnings.
[FINDBUGS] Successfully parsed file <https://builds.apache.org/job/Apache-falcon/ws/common/target/findbugs.xml>
of module  with 0 warnings.
[FINDBUGS] Successfully parsed file <https://builds.apache.org/job/Apache-falcon/ws/feed/target/findbugs.xml>
of module  with 0 warnings.
[FINDBUGS] Successfully parsed file <https://builds.apache.org/job/Apache-falcon/ws/hadoop-dependencies/target/findbugs.xml>
of module  with 0 warnings.
[FINDBUGS] Successfully parsed file <https://builds.apache.org/job/Apache-falcon/ws/hadoop-webapp/target/findbugs.xml>
of module  with 0 warnings.
[FINDBUGS] Successfully parsed file <https://builds.apache.org/job/Apache-falcon/ws/messaging/target/findbugs.xml>
of module  with 0 warnings.
[FINDBUGS] Successfully parsed file <https://builds.apache.org/job/Apache-falcon/ws/metrics/target/findbugs.xml>
of module  with 0 warnings.
[FINDBUGS] Successfully parsed file <https://builds.apache.org/job/Apache-falcon/ws/oozie-el-extensions/target/findbugs.xml>
of module  with 0 warnings.
[FINDBUGS] Successfully parsed file <https://builds.apache.org/job/Apache-falcon/ws/oozie/target/findbugs.xml>
of module  with 0 warnings.
[FINDBUGS] Successfully parsed file <https://builds.apache.org/job/Apache-falcon/ws/prism/target/findbugs.xml>
of module  with 0 warnings.
[FINDBUGS] Successfully parsed file <https://builds.apache.org/job/Apache-falcon/ws/process/target/findbugs.xml>
of module  with 0 warnings.
[FINDBUGS] Successfully parsed file <https://builds.apache.org/job/Apache-falcon/ws/replication/target/findbugs.xml>
of module  with 0 warnings.
[FINDBUGS] Successfully parsed file <https://builds.apache.org/job/Apache-falcon/ws/rerun/target/findbugs.xml>
of module  with 0 warnings.
[FINDBUGS] Successfully parsed file <https://builds.apache.org/job/Apache-falcon/ws/retention/target/findbugs.xml>
of module  with 0 warnings.
[FINDBUGS] Successfully parsed file <https://builds.apache.org/job/Apache-falcon/ws/test-util/target/findbugs.xml>
of module  with 0 warnings.
[FINDBUGS] Successfully parsed file <https://builds.apache.org/job/Apache-falcon/ws/webapp/target/findbugs.xml>
of module  with 0 warnings.
[FINDBUGS] Computing warning deltas based on reference build #465
Archiving artifacts
Sending artifact delta relative to Apache-falcon #465
Archived 15 artifacts
Archive block size is 32768
Received 292 blocks and 78266 bytes
Compression is 99.2%
Took 2.6 sec
Recording test results
TestNG Reports Processing: START
Looking for TestNG results report in workspace using pattern: **/target/testng-results.xml
Did not find any matching files.

Mime
View raw message