falcon-dev mailing list archives

Site index · List index
Message view « Date » · « Thread »
Top « Date » · « Thread »
From Seetharam Venkatesh <venkat...@innerzeal.com>
Subject Re: Build failed in Jenkins: Apache-falcon #419
Date Sat, 04 Oct 2014 00:07:39 GMT
We pinned to H0 and its the only server falcon nightly runs on.

On Tue, Sep 30, 2014 at 11:58 PM, Srikanth Sundarrajan <sriksun@hotmail.com>
wrote:

> Build is fairly unstable on jenkins, seems to run alright on dev's env. We
> need to resolve this.
>
> Regards
> Srikanth Sundarrajan
>
> > Date: Wed, 1 Oct 2014 06:35:37 +0000
> > From: jenkins@builds.apache.org
> > To: dev@falcon.incubator.apache.org
> > Subject: Build failed in Jenkins: Apache-falcon #419
> >
> > See <https://builds.apache.org/job/Apache-falcon/419/>
> >
> > ------------------------------------------
> > [...truncated 1435 lines...]
> > Tests run: 1, Failures: 0, Errors: 0, Skipped: 0, Time elapsed: 1.631
> sec - in org.apache.falcon.messaging.ProcessProducerTest
> >
> > Results :
> >
> > Tests run: 8, Failures: 0, Errors: 0, Skipped: 0
> >
> > [INFO]
> > [INFO] --- maven-site-plugin:3.2:site (default) @ falcon-messaging ---
> > [INFO] maven.site.skip = true: Skipping site generation
> > [INFO]
> > [INFO] --- maven-jar-plugin:2.4:jar (default-jar) @ falcon-messaging ---
> > [INFO] Building jar: <
> https://builds.apache.org/job/Apache-falcon/ws/messaging/target/falcon-messaging-0.6-incubating-SNAPSHOT.jar
> >
> > [INFO]
> > [INFO] --- maven-site-plugin:3.2:attach-descriptor (attach-descriptor) @
> falcon-messaging ---
> > [INFO]
> > [INFO] --- maven-failsafe-plugin:2.16:integration-test
> (integration-test) @ falcon-messaging ---
> > [WARNING] The parameter forkMode is deprecated since version 2.14. Use
> forkCount and reuseForks instead.
> > [INFO]
> > [INFO] --- maven-failsafe-plugin:2.16:verify (verify) @ falcon-messaging
> ---
> > [INFO] Failsafe report directory: <
> https://builds.apache.org/job/Apache-falcon/ws/messaging/target/failsafe-reports
> >
> > [INFO]
> > [INFO] --- apache-rat-plugin:0.7:check (rat-check) @ falcon-messaging ---
> > [INFO] Exclude: *.txt
> > [INFO] Exclude: **/*.txt
> > [INFO] Exclude: .git/**
> > [INFO] Exclude: **/.idea/**
> > [INFO] Exclude: **/*.twiki
> > [INFO] Exclude: **/*.iml
> > [INFO] Exclude: **/target/**
> > [INFO] Exclude: **/activemq-data/**
> > [INFO] Exclude: **/build/**
> > [INFO] Exclude: **/*.patch
> > [INFO] Exclude: derby.log
> > [INFO] Exclude: **/logs/**
> > [INFO] Exclude: **/.classpath
> > [INFO] Exclude: **/.project
> > [INFO] Exclude: **/.settings/**
> > [INFO] Exclude: **/test-output/**
> > [INFO] Exclude: **/data.txt
> > [INFO] Exclude: **/maven-eclipse.xml
> > [INFO] Exclude: **/.externalToolBuilders/**
> > [INFO] Exclude: html5-ui/**
> > [INFO]
> > [INFO] --- maven-checkstyle-plugin:2.9.1:check (checkstyle-check) @
> falcon-messaging ---
> > [INFO] Starting audit...
> > Audit done.
> >
> > [INFO]
> > [INFO] >>> findbugs-maven-plugin:2.5.2:check (findbugs-check) @
> falcon-messaging >>>
> > [WARNING] Failure to transfer asm:asm/maven-metadata.xml from
> file:../../local.repository/trunk was cached in the local repository,
> resolution will not be reattempted until the update interval of
> local.repository has elapsed or updates are forced. Original error: Could
> not transfer metadata asm:asm/maven-metadata.xml from/to local.repository
> (file:../../local.repository/trunk): No connector available to access
> repository local.repository (file:../../local.repository/trunk) of type
> legacy using the available factories WagonRepositoryConnectorFactory
> > [INFO]
> > [INFO] --- findbugs-maven-plugin:2.5.2:findbugs (findbugs) @
> falcon-messaging ---
> > [INFO] Fork Value is true
> > [INFO] Done FindBugs Analysis....
> > [INFO]
> > [INFO] <<< findbugs-maven-plugin:2.5.2:check (findbugs-check) @
> falcon-messaging <<<
> > [INFO]
> > [INFO] --- findbugs-maven-plugin:2.5.2:check (findbugs-check) @
> falcon-messaging ---
> > [INFO] BugInstance size is 0
> > [INFO] Error size is 0
> > [INFO] No errors/warnings found
> > [INFO]
> > [INFO]
> ------------------------------------------------------------------------
> > [INFO] Building Apache Falcon Oozie Adaptor 0.6-incubating-SNAPSHOT
> > [INFO]
> ------------------------------------------------------------------------
> > [WARNING] Failure to transfer asm:asm/maven-metadata.xml from
> file:../../local.repository/trunk was cached in the local repository,
> resolution will not be reattempted until the update interval of
> local.repository has elapsed or updates are forced. Original error: Could
> not transfer metadata asm:asm/maven-metadata.xml from/to local.repository
> (file:../../local.repository/trunk): No connector available to access
> repository local.repository (file:../../local.repository/trunk) of type
> legacy using the available factories WagonRepositoryConnectorFactory
> > [INFO]
> > [INFO] --- maven-clean-plugin:2.5:clean (default-clean) @
> falcon-oozie-adaptor ---
> > [INFO] Deleting <
> https://builds.apache.org/job/Apache-falcon/ws/oozie/target>
> > [INFO]
> > [INFO] --- maven-enforcer-plugin:1.3.1:enforce (enforce-property) @
> falcon-oozie-adaptor ---
> > [INFO]
> > [INFO] --- buildnumber-maven-plugin:1.0:create (default) @
> falcon-oozie-adaptor ---
> > [INFO] Checking for local modifications: skipped.
> > [INFO] Updating project files from SCM: skipped.
> > [INFO] Executing: /bin/sh -c cd <
> https://builds.apache.org/job/Apache-falcon/ws/oozie> && git show
> > [INFO] Working directory: <
> https://builds.apache.org/job/Apache-falcon/ws/oozie>
> > [INFO] Storing buildNumber: 9c74ee459a939a4b3aff31ad83b922b9c08e94da at
> timestamp: 1412141503482
> > [INFO] Executing: /bin/sh -c cd <
> https://builds.apache.org/job/Apache-falcon/ws/oozie> && git show
> > [INFO] Working directory: <
> https://builds.apache.org/job/Apache-falcon/ws/oozie>
> > [INFO] Storing buildScmBranch: UNKNOWN
> > [INFO]
> > [INFO] --- maven-dependency-plugin:2.8:unpack (unpack) @
> falcon-oozie-adaptor ---
> > [INFO] Configured Artifact: org.apache.oozie:oozie-client:?:jar
> > [INFO] Unpacking
> /home/jenkins/.m2/repository/org/apache/oozie/oozie-client/4.0.1-falcon/oozie-client-4.0.1-falcon.jar
> to <
> https://builds.apache.org/job/Apache-falcon/ws/oozie/target/oozie-schemas>
> with includes "**/*.xsd" and excludes "**/*.class"
> > [INFO]
> > [INFO] --- maven-jaxb2-plugin:0.9.0:generate (coord-gen) @
> falcon-oozie-adaptor ---
> > [INFO] Sources are not up-to-date; XJC execution will be executed.
> > [INFO]
> > [INFO] --- maven-jaxb2-plugin:0.9.0:generate (wf-gen) @
> falcon-oozie-adaptor ---
> > [INFO] Sources are up-to-date, but the [forceRegenerate] switch is
> turned on; XJC execution will not be skipped.
> > [INFO]
> > [INFO] --- maven-jaxb2-plugin:0.9.0:generate (hive-gen) @
> falcon-oozie-adaptor ---
> > [INFO] Sources are up-to-date, but the [forceRegenerate] switch is
> turned on; XJC execution will not be skipped.
> > [INFO]
> > [INFO] --- maven-jaxb2-plugin:0.9.0:generate (bundle-gen) @
> falcon-oozie-adaptor ---
> > [INFO] Sources are up-to-date, but the [forceRegenerate] switch is
> turned on; XJC execution will not be skipped.
> > [INFO]
> > [INFO] --- build-helper-maven-plugin:1.5:add-source (add-source) @
> falcon-oozie-adaptor ---
> > [INFO] Source directory: <
> https://builds.apache.org/job/Apache-falcon/ws/oozie/src/versioned-src/v1/java>
> added.
> > [INFO]
> > [INFO] --- maven-remote-resources-plugin:1.4:process (default) @
> falcon-oozie-adaptor ---
> > [INFO]
> > [INFO] --- maven-resources-plugin:2.6:resources (default-resources) @
> falcon-oozie-adaptor ---
> > [INFO] Using 'UTF-8' encoding to copy filtered resources.
> > [INFO] Copying 14 resources
> > [INFO] Copying 0 resource
> > [INFO] Copying 0 resource
> > [INFO] Copying 2 resources to META-INF
> > [INFO] Copying 1 resource
> > [INFO] Copying 1 resource
> > [INFO] Copying 1 resource
> > [INFO] Copying 1 resource
> > [INFO] Copying 3 resources
> > [INFO]
> > [INFO] --- maven-compiler-plugin:2.3.2:compile (default-compile) @
> falcon-oozie-adaptor ---
> > [INFO] Compiling 91 source files to <
> https://builds.apache.org/job/Apache-falcon/ws/oozie/target/classes>
> > [INFO]
> > [INFO] --- maven-resources-plugin:2.6:testResources
> (default-testResources) @ falcon-oozie-adaptor ---
> > [INFO] Using 'UTF-8' encoding to copy filtered resources.
> > [INFO] Copying 30 resources
> > [INFO] Copying 3 resources
> > [INFO]
> > [INFO] --- maven-compiler-plugin:2.3.2:testCompile (default-testCompile)
> @ falcon-oozie-adaptor ---
> > [INFO] Compiling 7 source files to <
> https://builds.apache.org/job/Apache-falcon/ws/oozie/target/test-classes>
> > [INFO]
> > [INFO] --- maven-surefire-plugin:2.16:test (default-test) @
> falcon-oozie-adaptor ---
> > [WARNING] The parameter forkMode is deprecated since version 2.14. Use
> forkCount and reuseForks instead.
> > [INFO] Surefire report directory: <
> https://builds.apache.org/job/Apache-falcon/ws/oozie/target/surefire-reports
> >
> >
> > -------------------------------------------------------
> >  T E S T S
> > -------------------------------------------------------
> >
> > -------------------------------------------------------
> >  T E S T S
> > -------------------------------------------------------
> > Running org.apache.falcon.oozie.feed.OozieFeedWorkflowBuilderTest
> > Tests run: 7, Failures: 0, Errors: 0, Skipped: 0, Time elapsed: 4.343
> sec - in org.apache.falcon.oozie.feed.OozieFeedWorkflowBuilderTest
> > Running org.apache.falcon.oozie.coordinator.CoordinatorUnmarshallingTest
> > Tests run: 1, Failures: 0, Errors: 0, Skipped: 0, Time elapsed: 0.925
> sec - in org.apache.falcon.oozie.coordinator.CoordinatorUnmarshallingTest
> > Running org.apache.falcon.oozie.process.OozieProcessWorkflowBuilderTest
> > Tests run: 17, Failures: 0, Errors: 0, Skipped: 0, Time elapsed: 7.516
> sec - in org.apache.falcon.oozie.process.OozieProcessWorkflowBuilderTest
> > Running org.apache.falcon.oozie.bundle.BundleUnmarshallingTest
> > Tests run: 1, Failures: 0, Errors: 0, Skipped: 0, Time elapsed: 0.799
> sec - in org.apache.falcon.oozie.bundle.BundleUnmarshallingTest
> > Running org.apache.falcon.oozie.workflow.FalconPostProcessingTest
> > Killed
> > Running org.apache.falcon.oozie.workflow.WorkflowUnmarshallingTest
> > Tests run: 1, Failures: 0, Errors: 0, Skipped: 0, Time elapsed: 0.963
> sec - in org.apache.falcon.oozie.workflow.WorkflowUnmarshallingTest
> >
> > Results :
> >
> > Tests run: 27, Failures: 0, Errors: 0, Skipped: 0
> >
> > [INFO]
> ------------------------------------------------------------------------
> > [INFO] Reactor Summary:
> > [INFO]
> > [INFO] Checkstyle ........................................ SUCCESS [
> 1.015 s]
> > [INFO] Apache Falcon ..................................... SUCCESS [
> 5.114 s]
> > [INFO] Build Tools ....................................... SUCCESS [
> 3.762 s]
> > [INFO] Apache Falcon CLI client .......................... SUCCESS [
> 25.208 s]
> > [INFO] Apache Falcon Metrics ............................. SUCCESS [
> 11.221 s]
> > [INFO] Apache Falcon Hadoop Dependencies ................. SUCCESS [
> 12.360 s]
> > [INFO] Apache Falcon Test Utility ........................ SUCCESS [
> 10.836 s]
> > [INFO] Apache Falcon Commons ............................. SUCCESS
> [01:12 min]
> > [INFO] Apache Falcon Oozie EL Extension .................. SUCCESS [
> 13.832 s]
> > [INFO] Apache Falcon Embedded Hadoop - Test Cluster ...... SUCCESS [
> 22.665 s]
> > [INFO] Apache Falcon Messaging ........................... SUCCESS [
> 22.557 s]
> > [INFO] Apache Falcon Oozie Adaptor ....................... FAILURE [
> 01:06 h]
> > [INFO] Apache Falcon Acquisition ......................... SKIPPED
> > [INFO] Apache Falcon Replication ......................... SKIPPED
> > [INFO] Apache Falcon Retention ........................... SKIPPED
> > [INFO] Apache Falcon Archival ............................ SKIPPED
> > [INFO] Apache Falcon Rerun ............................... SKIPPED
> > [INFO] Apache Falcon Prism ............................... SKIPPED
> > [INFO] Apache Falcon Web Application ..................... SKIPPED
> > [INFO] Apache Falcon Documentation ....................... SKIPPED
> > [INFO]
> ------------------------------------------------------------------------
> > [INFO] BUILD FAILURE
> > [INFO]
> ------------------------------------------------------------------------
> > [INFO] Total time: 01:09 h
> > [INFO] Finished at: 2014-10-01T06:37:52+00:00
> > [INFO] Final Memory: 167M/763M
> > [INFO]
> ------------------------------------------------------------------------
> > [ERROR] Failed to execute goal
> org.apache.maven.plugins:maven-surefire-plugin:2.16:test (default-test) on
> project falcon-oozie-adaptor: ExecutionException; nested exception is
> java.util.concurrent.ExecutionException: java.lang.RuntimeException: The
> forked VM terminated without saying properly goodbye. VM crash or
> System.exit called ?
> > [ERROR] Command was/bin/sh -c cd <
> https://builds.apache.org/job/Apache-falcon/ws/oozie> &&
> /home/jenkins/tools/java/jdk1.6.0_45-64/jre/bin/java
> -Djava.awt.headless=true -Djava.security.krb5.realm=
> -Djava.security.krb5.kdc= -jar <
> https://builds.apache.org/job/Apache-falcon/ws/oozie/target/surefire/surefirebooter394199510063267589.jar>
> <
> https://builds.apache.org/job/Apache-falcon/ws/oozie/target/surefire/surefire3491919565071538489tmp>
> <
> https://builds.apache.org/job/Apache-falcon/ws/oozie/target/surefire/surefire_418375917924865849371tmp
> >
> > [ERROR] -> [Help 1]
> > [ERROR]
> > [ERROR] To see the full stack trace of the errors, re-run Maven with the
> -e switch.
> > [ERROR] Re-run Maven using the -X switch to enable full debug logging.
> > [ERROR]
> > [ERROR] For more information about the errors and possible solutions,
> please read the following articles:
> > [ERROR] [Help 1]
> http://cwiki.apache.org/confluence/display/MAVEN/MojoFailureException
> > [ERROR]
> > [ERROR] After correcting the problems, you can resume the build with the
> command
> > [ERROR]   mvn <goals> -rf :falcon-oozie-adaptor
> > Build step 'Execute shell' marked build as failure
> > [CHECKSTYLE] Collecting checkstyle analysis files...
> > [CHECKSTYLE] Finding all files that match the pattern
> **/target/checkstyle-result.xml
> > [CHECKSTYLE] Parsing 19 files in <
> https://builds.apache.org/job/Apache-falcon/ws/>
> > [CHECKSTYLE] Successfully parsed file <
> https://builds.apache.org/job/Apache-falcon/ws/acquisition/target/checkstyle-result.xml>
> of module  with 0 warnings.
> > [CHECKSTYLE] Successfully parsed file <
> https://builds.apache.org/job/Apache-falcon/ws/archival/target/checkstyle-result.xml>
> of module  with 0 warnings.
> > [CHECKSTYLE] Successfully parsed file <
> https://builds.apache.org/job/Apache-falcon/ws/build-tools/target/checkstyle-result.xml>
> of module  with 0 warnings.
> > [CHECKSTYLE] Successfully parsed file <
> https://builds.apache.org/job/Apache-falcon/ws/client/target/checkstyle-result.xml>
> of module  with 0 warnings.
> > [CHECKSTYLE] Successfully parsed file <
> https://builds.apache.org/job/Apache-falcon/ws/common/target/checkstyle-result.xml>
> of module  with 0 warnings.
> > [CHECKSTYLE] Successfully parsed file <
> https://builds.apache.org/job/Apache-falcon/ws/docs/target/checkstyle-result.xml>
> of module  with 0 warnings.
> > [CHECKSTYLE] Successfully parsed file <
> https://builds.apache.org/job/Apache-falcon/ws/feed/target/checkstyle-result.xml>
> of module  with 0 warnings.
> > [CHECKSTYLE] Successfully parsed file <
> https://builds.apache.org/job/Apache-falcon/ws/hadoop-dependencies/target/checkstyle-result.xml>
> of module  with 0 warnings.
> > [CHECKSTYLE] Successfully parsed file <
> https://builds.apache.org/job/Apache-falcon/ws/hadoop-webapp/target/checkstyle-result.xml>
> of module  with 0 warnings.
> > [CHECKSTYLE] Successfully parsed file <
> https://builds.apache.org/job/Apache-falcon/ws/messaging/target/checkstyle-result.xml>
> of module  with 0 warnings.
> > [CHECKSTYLE] Successfully parsed file <
> https://builds.apache.org/job/Apache-falcon/ws/metrics/target/checkstyle-result.xml>
> of module  with 0 warnings.
> > [CHECKSTYLE] Successfully parsed file <
> https://builds.apache.org/job/Apache-falcon/ws/oozie-el-extensions/target/checkstyle-result.xml>
> of module  with 0 warnings.
> > [CHECKSTYLE] Successfully parsed file <
> https://builds.apache.org/job/Apache-falcon/ws/prism/target/checkstyle-result.xml>
> of module  with 0 warnings.
> > [CHECKSTYLE] Successfully parsed file <
> https://builds.apache.org/job/Apache-falcon/ws/process/target/checkstyle-result.xml>
> of module  with 0 warnings.
> > [CHECKSTYLE] Successfully parsed file <
> https://builds.apache.org/job/Apache-falcon/ws/replication/target/checkstyle-result.xml>
> of module  with 0 warnings.
> > [CHECKSTYLE] Successfully parsed file <
> https://builds.apache.org/job/Apache-falcon/ws/rerun/target/checkstyle-result.xml>
> of module  with 0 warnings.
> > [CHECKSTYLE] Successfully parsed file <
> https://builds.apache.org/job/Apache-falcon/ws/retention/target/checkstyle-result.xml>
> of module  with 0 warnings.
> > [CHECKSTYLE] Successfully parsed file <
> https://builds.apache.org/job/Apache-falcon/ws/target/checkstyle-result.xml>
> of module  with 0 warnings.
> > [CHECKSTYLE] Successfully parsed file <
> https://builds.apache.org/job/Apache-falcon/ws/test-util/target/checkstyle-result.xml>
> of module  with 0 warnings.
> > [CHECKSTYLE] Computing warning deltas based on reference build #404
> > [FINDBUGS] Collecting findbugs analysis files...
> > [FINDBUGS] Finding all files that match the pattern
> **/target/findbugs.xml
> > [FINDBUGS] Parsing 14 files in <
> https://builds.apache.org/job/Apache-falcon/ws/>
> > [FINDBUGS] Successfully parsed file <
> https://builds.apache.org/job/Apache-falcon/ws/client/target/findbugs.xml>
> of module  with 0 warnings.
> > [FINDBUGS] Successfully parsed file <
> https://builds.apache.org/job/Apache-falcon/ws/common/target/findbugs.xml>
> of module  with 0 warnings.
> > [FINDBUGS] Successfully parsed file <
> https://builds.apache.org/job/Apache-falcon/ws/feed/target/findbugs.xml>
> of module  with 0 warnings.
> > [FINDBUGS] Successfully parsed file <
> https://builds.apache.org/job/Apache-falcon/ws/hadoop-dependencies/target/findbugs.xml>
> of module  with 0 warnings.
> > [FINDBUGS] Successfully parsed file <
> https://builds.apache.org/job/Apache-falcon/ws/hadoop-webapp/target/findbugs.xml>
> of module  with 0 warnings.
> > [FINDBUGS] Successfully parsed file <
> https://builds.apache.org/job/Apache-falcon/ws/messaging/target/findbugs.xml>
> of module  with 0 warnings.
> > [FINDBUGS] Successfully parsed file <
> https://builds.apache.org/job/Apache-falcon/ws/metrics/target/findbugs.xml>
> of module  with 0 warnings.
> > [FINDBUGS] Successfully parsed file <
> https://builds.apache.org/job/Apache-falcon/ws/oozie-el-extensions/target/findbugs.xml>
> of module  with 0 warnings.
> > [FINDBUGS] Successfully parsed file <
> https://builds.apache.org/job/Apache-falcon/ws/prism/target/findbugs.xml>
> of module  with 0 warnings.
> > [FINDBUGS] Successfully parsed file <
> https://builds.apache.org/job/Apache-falcon/ws/process/target/findbugs.xml>
> of module  with 0 warnings.
> > [FINDBUGS] Successfully parsed file <
> https://builds.apache.org/job/Apache-falcon/ws/replication/target/findbugs.xml>
> of module  with 0 warnings.
> > [FINDBUGS] Successfully parsed file <
> https://builds.apache.org/job/Apache-falcon/ws/rerun/target/findbugs.xml>
> of module  with 0 warnings.
> > [FINDBUGS] Successfully parsed file <
> https://builds.apache.org/job/Apache-falcon/ws/retention/target/findbugs.xml>
> of module  with 0 warnings.
> > [FINDBUGS] Successfully parsed file <
> https://builds.apache.org/job/Apache-falcon/ws/test-util/target/findbugs.xml>
> of module  with 0 warnings.
> > [FINDBUGS] Computing warning deltas based on reference build #404
> > Archiving artifacts
> > Sending artifact delta relative to Apache-falcon #404
> > Archived 15 artifacts
> > Archive block size is 32768
> > Received 0 blocks and 818380 bytes
> > Compression is 0.0%
> > Took 0.28 sec
> > Recording test results
> > TestNG Reports Processing: START
> > Looking for TestNG results report in workspace using pattern:
> **/target/testng-results.xml
> > Did not find any matching files.
>
>



-- 
Regards,
Venkatesh

“Perfection (in design) is achieved not when there is nothing more to add,
but rather when there is nothing more to take away.”
- Antoine de Saint-Exupéry

Mime
  • Unnamed multipart/alternative (inline, None, 0 bytes)
View raw message