falcon-dev mailing list archives

Site index · List index
Message view « Date » · « Thread »
Top « Date » · « Thread »
From Apache Jenkins Server <jenk...@builds.apache.org>
Subject Build failed in Jenkins: Apache-Falcon-Distributed-Assembly #195
Date Wed, 08 Oct 2014 02:31:04 GMT
See <https://builds.apache.org/job/Apache-Falcon-Distributed-Assembly/195/changes>

Changes:

[rostafiychuk] FALCON-779 ProcessInstanceStatusTest#testProcessInstanceStatusReverseDateRange
fixed. Contributed by Paul Isaychuk

------------------------------------------
Started by timer
Building remotely on H4 (Mapreduce zookeeper Hadoop Pig falcon Hdfs) in workspace <https://builds.apache.org/job/Apache-Falcon-Distributed-Assembly/ws/>
Updating http://svn.apache.org/repos/asf/hadoop/nightly at revision '2014-10-08T02:30:40.371
+0000'
At revision 1630000
no change for http://svn.apache.org/repos/asf/hadoop/nightly since the previous build
 > git rev-parse --is-inside-work-tree
Fetching changes from the remote Git repository
 > git config remote.origin.url https://git-wip-us.apache.org/repos/asf/incubator-falcon.git
Fetching upstream changes from https://git-wip-us.apache.org/repos/asf/incubator-falcon.git
 > git --version
 > git fetch --tags --progress https://git-wip-us.apache.org/repos/asf/incubator-falcon.git
+refs/heads/*:refs/remotes/origin/*
 > git rev-parse origin/master^{commit}
Checking out Revision 5c305434c615b5e91b17d6e3918f7a47cf4551a8 (origin/master)
 > git config core.sparsecheckout
 > git checkout -f 5c305434c615b5e91b17d6e3918f7a47cf4551a8
 > git rev-list 74b206319d16cc5c8412768a88fb50ed967dcb3c
[Apache-Falcon-Distributed-Assembly] $ /bin/bash -xe /tmp/hudson8019792136551840790.sh
+ source nightly/hudsonEnv.sh
++ export TOOLS_HOME=/home/jenkins/tools
++ TOOLS_HOME=/home/jenkins/tools
++ export JAVA_HOME=/home/jenkins/tools/java/latest
++ JAVA_HOME=/home/jenkins/tools/java/latest
++ export ANT_HOME=/home/jenkins/tools/ant/latest
++ ANT_HOME=/home/jenkins/tools/ant/latest
++ export FORREST_HOME=/home/jenkins/tools/forrest/latest
++ FORREST_HOME=/home/jenkins/tools/forrest/latest
++ export JAVA5_HOME=/home/jenkins/tools/java/latest1.5
++ JAVA5_HOME=/home/jenkins/tools/java/latest1.5
++ export FINDBUGS_HOME=/home/jenkins/tools/findbugs/latest
++ FINDBUGS_HOME=/home/jenkins/tools/findbugs/latest
++ export CLOVER_HOME=/home/jenkins/tools/clover/latest
++ CLOVER_HOME=/home/jenkins/tools/clover/latest
++ export MAVEN_HOME=/home/jenkins/tools/maven/latest
++ MAVEN_HOME=/home/jenkins/tools/maven/latest
++ export PATH=/home/jenkins/tools/java/latest1.6/bin:/home/jenkins/tools/java/latest1.6/bin:/usr/local/sbin:/usr/local/bin:/usr/sbin:/usr/bin:/sbin:/bin:/usr/games:/usr/local/games:/home/jenkins/tools/java/latest/bin:/home/jenkins/tools/ant/latest/bin:
++ PATH=/home/jenkins/tools/java/latest1.6/bin:/home/jenkins/tools/java/latest1.6/bin:/usr/local/sbin:/usr/local/bin:/usr/sbin:/usr/bin:/sbin:/bin:/usr/games:/usr/local/games:/home/jenkins/tools/java/latest/bin:/home/jenkins/tools/ant/latest/bin:
++ export ANT_OPTS=-Xmx2048m
++ ANT_OPTS=-Xmx2048m
++ export MAVEN_OPTS=-Xmx2048m
++ MAVEN_OPTS=-Xmx2048m
++ TRUNK=<https://builds.apache.org/job/Apache-Falcon-Distributed-Assembly/ws/trunk>
++ ulimit -n
60000
+ /home/jenkins/tools/maven/latest/bin/mvn clean package assembly:assembly -P distributed,hadoop-1
-DskipTests -DskipITs
[INFO] Scanning for projects...
[ERROR] The build could not read 12 projects -> [Help 1]
[ERROR]   
[ERROR]   The project org.apache.falcon:falcon-client:0.6-incubating-SNAPSHOT (<https://builds.apache.org/job/Apache-Falcon-Distributed-Assembly/ws/client/pom.xml)>
has 2 errors
[ERROR]     'dependencies.dependency.version' for org.apache.hadoop:hadoop-auth:jar must be
a valid version but is '${hadoop.version}'. @ org.apache.falcon:falcon-main:0.6-incubating-SNAPSHOT,
<https://builds.apache.org/job/Apache-Falcon-Distributed-Assembly/ws/pom.xml,> line
784, column 26
[ERROR]     'dependencies.dependency.version' for org.apache.hadoop:hadoop-client:jar is missing.
@ line 46, column 29
[ERROR]   
[ERROR]   The project org.apache.falcon:falcon-common:0.6-incubating-SNAPSHOT (<https://builds.apache.org/job/Apache-Falcon-Distributed-Assembly/ws/common/pom.xml)>
has 5 errors
[ERROR]     'dependencies.dependency.version' for org.apache.hadoop:hadoop-client:jar is missing.
@ line 42, column 29
[ERROR]     'dependencies.dependency.version' for org.apache.hadoop:hadoop-hdfs:jar is missing.
@ line 46, column 29
[ERROR]     'dependencies.dependency.version' for org.apache.hadoop:hadoop-hdfs:jar:tests
is missing. @ line 50, column 29
[ERROR]     'dependencies.dependency.version' for org.apache.hadoop:hadoop-common:jar:tests
is missing. @ line 55, column 30
[ERROR]     'dependencies.dependency.version' for org.apache.hadoop:hadoop-common:jar is missing.
@ line 60, column 30
[ERROR]   
[ERROR]   The project org.apache.falcon:falcon-test-util:0.6-incubating-SNAPSHOT (<https://builds.apache.org/job/Apache-Falcon-Distributed-Assembly/ws/test-util/pom.xml)>
has 5 errors
[ERROR]     'dependencies.dependency.version' for org.apache.hadoop:hadoop-client:jar is missing.
@ line 41, column 29
[ERROR]     'dependencies.dependency.version' for org.apache.hadoop:hadoop-hdfs:jar:tests
is missing. @ line 46, column 29
[ERROR]     'dependencies.dependency.version' for org.apache.hadoop:hadoop-common:jar:tests
is missing. @ line 52, column 29
[ERROR]     'dependencies.dependency.version' for org.apache.hadoop:hadoop-hdfs:jar is missing.
@ line 58, column 29
[ERROR]     'dependencies.dependency.version' for org.apache.hadoop:hadoop-common:jar is missing.
@ line 63, column 29
[ERROR]   
[ERROR]   The project org.apache.falcon:falcon-hadoop-dependencies:0.6-incubating-SNAPSHOT
(<https://builds.apache.org/job/Apache-Falcon-Distributed-Assembly/ws/hadoop-dependencies/pom.xml)>
has 7 errors
[ERROR]     'dependencies.dependency.version' for org.apache.hadoop:hadoop-client:jar is missing.
@ line 40, column 29
[ERROR]     'dependencies.dependency.version' for org.apache.hadoop:hadoop-hdfs:jar is missing.
@ line 46, column 29
[ERROR]     'dependencies.dependency.version' for org.apache.hadoop:hadoop-common:jar is missing.
@ line 52, column 29
[ERROR]     'dependencies.dependency.version' for org.apache.hadoop:hadoop-auth:jar must be
a valid version but is '${hadoop.version}'. @ org.apache.falcon:falcon-main:0.6-incubating-SNAPSHOT,
<https://builds.apache.org/job/Apache-Falcon-Distributed-Assembly/ws/pom.xml,> line
784, column 26
[ERROR]     'dependencies.dependency.version' for org.apache.hadoop:hadoop-mapreduce-client-common:jar
is missing. @ line 64, column 29
[ERROR]     'dependencies.dependency.version' for org.apache.hadoop:hadoop-yarn-server-resourcemanager:jar
is missing. @ line 70, column 29
[ERROR]     'dependencies.dependency.version' for org.apache.hadoop:hadoop-yarn-server-nodemanager:jar
is missing. @ line 76, column 29
[ERROR]   
[ERROR]   The project org.apache.falcon:falcon-hadoop-webapp:0.6-incubating-SNAPSHOT (<https://builds.apache.org/job/Apache-Falcon-Distributed-Assembly/ws/hadoop-webapp/pom.xml)>
has 8 errors
[ERROR]     'dependencies.dependency.version' for org.apache.hadoop:hadoop-client:jar is missing.
@ line 41, column 29
[ERROR]     'dependencies.dependency.version' for org.apache.hadoop:hadoop-hdfs:jar:tests
is missing. @ line 47, column 29
[ERROR]     'dependencies.dependency.version' for org.apache.hadoop:hadoop-hdfs:jar is missing.
@ line 53, column 29
[ERROR]     'dependencies.dependency.version' for org.apache.hadoop:hadoop-common:jar is missing.
@ line 59, column 29
[ERROR]     'dependencies.dependency.version' for org.apache.hadoop:hadoop-auth:jar must be
a valid version but is '${hadoop.version}'. @ org.apache.falcon:falcon-main:0.6-incubating-SNAPSHOT,
<https://builds.apache.org/job/Apache-Falcon-Distributed-Assembly/ws/pom.xml,> line
784, column 26
[ERROR]     'dependencies.dependency.version' for org.apache.hadoop:hadoop-mapreduce-client-common:jar
is missing. @ line 71, column 29
[ERROR]     'dependencies.dependency.version' for org.apache.hadoop:hadoop-yarn-server-resourcemanager:jar
is missing. @ line 77, column 29
[ERROR]     'dependencies.dependency.version' for org.apache.hadoop:hadoop-yarn-server-nodemanager:jar
is missing. @ line 83, column 29
[ERROR]   
[ERROR]   The project org.apache.falcon:falcon-messaging:0.6-incubating-SNAPSHOT (<https://builds.apache.org/job/Apache-Falcon-Distributed-Assembly/ws/messaging/pom.xml)>
has 5 errors
[ERROR]     'dependencies.dependency.version' for org.apache.hadoop:hadoop-client:jar is missing.
@ line 41, column 30
[ERROR]     'dependencies.dependency.version' for org.apache.hadoop:hadoop-common:jar is missing.
@ line 45, column 29
[ERROR]     'dependencies.dependency.version' for org.apache.hadoop:hadoop-hdfs:jar is missing.
@ line 49, column 29
[ERROR]     'dependencies.dependency.version' for org.apache.hadoop:hadoop-hdfs:jar:tests
is missing. @ line 53, column 29
[ERROR]     'dependencies.dependency.version' for org.apache.hadoop:hadoop-common:jar:tests
is missing. @ line 58, column 30
[ERROR]   
[ERROR]   The project org.apache.falcon:falcon-oozie-el-extension:0.6-incubating-SNAPSHOT
(<https://builds.apache.org/job/Apache-Falcon-Distributed-Assembly/ws/oozie-el-extensions/pom.xml)>
has 1 error
[ERROR]     'dependencies.dependency.version' for org.apache.hadoop:hadoop-client:jar is missing.
@ line 41, column 29
[ERROR]   
[ERROR]   The project org.apache.falcon:falcon-oozie-adaptor:0.6-incubating-SNAPSHOT (<https://builds.apache.org/job/Apache-Falcon-Distributed-Assembly/ws/oozie/pom.xml)>
has 1 error
[ERROR]     'dependencies.dependency.version' for org.apache.hadoop:hadoop-client:jar is missing.
@ line 41, column 29
[ERROR]   
[ERROR]   The project org.apache.falcon:falcon-replication:0.6-incubating-SNAPSHOT (<https://builds.apache.org/job/Apache-Falcon-Distributed-Assembly/ws/replication/pom.xml)>
has 1 error
[ERROR]     'dependencies.dependency.version' for org.apache.hadoop:hadoop-client:jar is missing.
@ line 41, column 30
[ERROR]   
[ERROR]   The project org.apache.falcon:falcon-retention:0.6-incubating-SNAPSHOT (<https://builds.apache.org/job/Apache-Falcon-Distributed-Assembly/ws/retention/pom.xml)>
has 4 errors
[ERROR]     'dependencies.dependency.version' for org.apache.hadoop:hadoop-common:jar is missing.
@ line 42, column 29
[ERROR]     'dependencies.dependency.version' for org.apache.hadoop:hadoop-hdfs:jar is missing.
@ line 46, column 29
[ERROR]     'dependencies.dependency.version' for org.apache.hadoop:hadoop-hdfs:jar:tests
is missing. @ line 50, column 29
[ERROR]     'dependencies.dependency.version' for org.apache.hadoop:hadoop-common:jar:tests
is missing. @ line 55, column 30
[ERROR]   
[ERROR]   The project org.apache.falcon:falcon-rerun:0.6-incubating-SNAPSHOT (<https://builds.apache.org/job/Apache-Falcon-Distributed-Assembly/ws/rerun/pom.xml)>
has 1 error
[ERROR]     'dependencies.dependency.version' for org.apache.hadoop:hadoop-client:jar is missing.
@ line 42, column 29
[ERROR]   
[ERROR]   The project org.apache.falcon:falcon-prism:0.6-incubating-SNAPSHOT (<https://builds.apache.org/job/Apache-Falcon-Distributed-Assembly/ws/prism/pom.xml)>
has 1 error
[ERROR]     'dependencies.dependency.version' for org.apache.hadoop:hadoop-client:jar is missing.
@ line 42, column 29
[ERROR] 
[ERROR] To see the full stack trace of the errors, re-run Maven with the -e switch.
[ERROR] Re-run Maven using the -X switch to enable full debug logging.
[ERROR] 
[ERROR] For more information about the errors and possible solutions, please read the following
articles:
[ERROR] [Help 1] http://cwiki.apache.org/confluence/display/MAVEN/ProjectBuildingException
Build step 'Execute shell' marked build as failure
Archiving artifacts
Sending artifact delta relative to Apache-Falcon-Distributed-Assembly #193
Archived 1 artifacts
Archive block size is 32768
Received 4097 blocks and 16095 bytes
Compression is 100.0%
Took 11 sec

Mime
View raw message