falcon-dev mailing list archives

Site index · List index
Message view « Date » · « Thread »
Top « Date » · « Thread »
From "Balu Vellanki (JIRA)" <j...@apache.org>
Subject [jira] [Updated] (FALCON-724) Build fails as Integration test fails
Date Tue, 16 Sep 2014 01:17:34 GMT

     [ https://issues.apache.org/jira/browse/FALCON-724?page=com.atlassian.jira.plugin.system.issuetabpanels:all-tabpanel
]

Balu Vellanki updated FALCON-724:
---------------------------------
    Attachment: FALCON-724-v1.patch

Refactored code to separate out tests for entity list pagination into a separate file. 

> Build fails as Integration test fails
> -------------------------------------
>
>                 Key: FALCON-724
>                 URL: https://issues.apache.org/jira/browse/FALCON-724
>             Project: Falcon
>          Issue Type: Bug
>          Components: webapp
>    Affects Versions: 0.6
>            Reporter: Srikanth Sundarrajan
>            Assignee: Balu Vellanki
>             Fix For: 0.6
>
>         Attachments: FALCON-724-v1.patch, FALCON-724.patch
>
>
> There are build failures that need to be looked into.
> {noformat}
> Results :
>  
> Failed tests: 
>   EntityManagerJerseyIT.testGetEntityList:761 NullPointer
> ...
> [INFO] Apache Falcon Web Application ..................... FAILURE [09:46 min]
> [INFO] Apache Falcon Documentation ....................... SKIPPED
> [INFO] ------------------------------------------------------------------------
> [INFO] BUILD FAILURE
> ...
> [ERROR] Failed to execute goal org.apache.maven.plugins:maven-failsafe-plugin:2.16:verify
(verify) on project falcon-webapp: There are test failures.
> {noformat}
> Specific details about the failure:
> {noformat}
>       java.lang.NullPointerException
> 	at org.apache.falcon.resource.EntityManagerJerseyIT.testGetEntityList(EntityManagerJerseyIT.java:761)
> 	at sun.reflect.NativeMethodAccessorImpl.invoke0(Native Method)
> 	at sun.reflect.NativeMethodAccessorImpl.invoke(NativeMethodAccessorImpl.java:39)
> 	at sun.reflect.DelegatingMethodAccessorImpl.invoke(DelegatingMethodAccessorImpl.java:25)
> 	at java.lang.reflect.Method.invoke(Method.java:597)
> 	at org.testng.internal.MethodInvocationHelper.invokeMethod(MethodInvocationHelper.java:80)
> 	at org.testng.internal.Invoker.invokeMethod(Invoker.java:673)
> 	at org.testng.internal.Invoker.invokeTestMethod(Invoker.java:842)
> 	at org.testng.internal.Invoker.invokeTestMethods(Invoker.java:1166)
> 	at org.testng.internal.TestMethodWorker.invokeTestMethods(TestMethodWorker.java:125)
> 	at org.testng.internal.TestMethodWorker.run(TestMethodWorker.java:109)
> 	at org.testng.TestRunner.runWorkers(TestRunner.java:1178)
> 	at org.testng.TestRunner.privateRun(TestRunner.java:757)
> 	at org.testng.TestRunner.run(TestRunner.java:608)
> 	at org.testng.SuiteRunner.runTest(SuiteRunner.java:334)
> 	at org.testng.SuiteRunner.runSequentially(SuiteRunner.java:329)
> 	at org.testng.SuiteRunner.privateRun(SuiteRunner.java:291)
> 	at org.testng.SuiteRunner.run(SuiteRunner.java:240)
> 	at org.testng.SuiteRunnerWorker.runSuite(SuiteRunnerWorker.java:52)
> 	at org.testng.SuiteRunnerWorker.run(SuiteRunnerWorker.java:86)
> 	at org.testng.TestNG.runSuitesSequentially(TestNG.java:1158)
> 	at org.testng.TestNG.runSuitesLocally(TestNG.java:1083)
> 	at org.testng.TestNG.run(TestNG.java:999)
> 	at org.apache.maven.surefire.testng.TestNGExecutor.run(TestNGExecutor.java:91)
> 	at org.apache.maven.surefire.testng.TestNGDirectoryTestSuite.executeSingleClass(TestNGDirectoryTestSuite.java:128)
> 	at org.apache.maven.surefire.testng.TestNGDirectoryTestSuite.execute(TestNGDirectoryTestSuite.java:112)
> 	at org.apache.maven.surefire.testng.TestNGProvider.invoke(TestNGProvider.java:113)
> 	at org.apache.maven.surefire.booter.ForkedBooter.invokeProviderInSameClassLoader(ForkedBooter.java:200)
> 	at org.apache.maven.surefire.booter.ForkedBooter.runSuitesInProcess(ForkedBooter.java:153)
> 	at org.apache.maven.surefire.booter.ForkedBooter.main(ForkedBooter.java:103)
> {noformat}
> Refer: https://builds.apache.org/job/Apache-falcon/408/testReport/org.apache.falcon.resource/EntityManagerJerseyIT/testGetEntityList/
for more details.



--
This message was sent by Atlassian JIRA
(v6.3.4#6332)

Mime
View raw message