falcon-dev mailing list archives

Site index · List index
Message view « Date » · « Thread »
Top « Date » · « Thread »
From "Srikanth Sundarrajan (JIRA)" <j...@apache.org>
Subject [jira] [Commented] (FALCON-328) failed: A required class was missing while executing org.mortbay.jetty:maven-jetty-plugin:6.1.26:run: org/mortbay/util/Attributes
Date Thu, 11 Sep 2014 04:17:34 GMT

    [ https://issues.apache.org/jira/browse/FALCON-328?page=com.atlassian.jira.plugin.system.issuetabpanels:comment-tabpanel&focusedCommentId=14129594#comment-14129594
] 

Srikanth Sundarrajan commented on FALCON-328:
---------------------------------------------

Looks like we have never had failure on H0, while on all other hosts there has been failure.
[~gkesavan], anything different in H0 compared to the others? Last night fixes haven't helped.

{noformat}
build#, host, status, Reason
320, hadoop8, SUCCESS,
321, hadoop7, SUCCESS,
322, hadoop8, SUCCESS,
323, hadoop8, SUCCESS,
324, hadoop8, SUCCESS,
325, hadoop8, SUCCESS,
326, hadoop8, SUCCESS,
327, hadoop8, SUCCESS,
328, hadoop8, SUCCESS,
329, hadoop7, SUCCESS,
330, hadoop7, SUCCESS,
331, hadoop7, SUCCESS,
332, hadoop8, SUCCESS,
333, hadoop7, SUCCESS,
334, hadoop8, SUCCESS,
335, H4, FAILURE,
336, H2, FAILURE, build-tools: Command execution failed. Process exited with an error: 127
(Exit value: 127) -> [Help 1]
337, H2, FAILURE, falcon-webapp: Execution start-jetty:6.1.26:run failed: A required class
was missing while executing org.mortbay.jetty:maven-jetty-plugin:6.1.26:run: org/mortbay/util/Attributes
338, H2, FAILURE, falcon-webapp: Execution start-jetty:6.1.26:run failed: A required class
was missing while executing org.mortbay.jetty:maven-jetty-plugin:6.1.26:run: org/mortbay/util/Attributes
339, H4, FAILURE, falcon-webapp: Execution start-jetty:6.1.26:run failed: A required class
was missing while executing org.mortbay.jetty:maven-jetty-plugin:6.1.26:run: org/mortbay/util/Attributes
340, H4, FAILURE, falcon-webapp: Execution start-jetty:6.1.26:run failed: A required class
was missing while executing org.mortbay.jetty:maven-jetty-plugin:6.1.26:run: org/mortbay/util/Attributes
341, H4, FAILURE, falcon-webapp: Execution start-jetty:6.1.26:run failed: A required class
was missing while executing org.mortbay.jetty:maven-jetty-plugin:6.1.26:run: org/mortbay/util/Attributes
342, H4, FAILURE, falcon-webapp: Execution start-jetty:6.1.26:run failed: A required class
was missing while executing org.mortbay.jetty:maven-jetty-plugin:6.1.26:run: org/mortbay/util/Attributes
343, H4, FAILURE, falcon-webapp: Execution start-jetty:6.1.26:run failed: A required class
was missing while executing org.mortbay.jetty:maven-jetty-plugin:6.1.26:run: org/mortbay/util/Attributes
344, H3, FAILURE, falcon-webapp: Execution start-jetty:6.1.26:run failed: A required class
was missing while executing org.mortbay.jetty:maven-jetty-plugin:6.1.26:run: org/mortbay/util/Attributes
345, H1, FAILURE, falcon-webapp: Execution start-jetty:6.1.26:run failed: A required class
was missing while executing org.mortbay.jetty:maven-jetty-plugin:6.1.26:run: org/mortbay/util/Attributes
346, H5, FAILURE, falcon-webapp: Execution start-jetty:6.1.26:run failed: A required class
was missing while executing org.mortbay.jetty:maven-jetty-plugin:6.1.26:run: org/mortbay/util/Attributes
347, H5, FAILURE, falcon-webapp: Execution start-jetty:6.1.26:run failed: A required class
was missing while executing org.mortbay.jetty:maven-jetty-plugin:6.1.26:run: org/mortbay/util/Attributes
348, H4, FAILURE, falcon-webapp: Execution start-jetty:6.1.26:run failed: A required class
was missing while executing org.mortbay.jetty:maven-jetty-plugin:6.1.26:run: org/mortbay/util/Attributes
349, H1, FAILURE, falcon-webapp: Execution start-jetty:6.1.26:run failed: A required class
was missing while executing org.mortbay.jetty:maven-jetty-plugin:6.1.26:run: org/mortbay/util/Attributes
350, H4, FAILURE, falcon-webapp: Execution start-jetty:6.1.26:run failed: A required class
was missing while executing org.mortbay.jetty:maven-jetty-plugin:6.1.26:run: org/mortbay/util/Attributes
351, H3, FAILURE, falcon-webapp: Execution start-jetty:6.1.26:run failed: A required class
was missing while executing org.mortbay.jetty:maven-jetty-plugin:6.1.26:run: org/mortbay/util/Attributes
352, H0, FAILURE, falcon-main: Plugin org.codehaus.mojo:buildnumber-maven-plugin:1.0 or one
of its dependencies could not be resolved: 
353, H4, FAILURE, falcon-webapp: Execution start-jetty:6.1.26:run failed: A required class
was missing while executing org.mortbay.jetty:maven-jetty-plugin:6.1.26:run: org/mortbay/util/Attributes
354, H4, FAILURE, falcon-webapp: Execution start-jetty:6.1.26:run failed: A required class
was missing while executing org.mortbay.jetty:maven-jetty-plugin:6.1.26:run: org/mortbay/util/Attributes
355, H4, FAILURE, falcon-webapp: Execution start-jetty:6.1.26:run failed: A required class
was missing while executing org.mortbay.jetty:maven-jetty-plugin:6.1.26:run: org/mortbay/util/Attributes
356, H0, FAILURE, falcon-webapp: There are test failures.
357, H3, FAILURE, falcon-webapp: Execution start-jetty:6.1.26:run failed: A required class
was missing while executing org.mortbay.jetty:maven-jetty-plugin:6.1.26:run: org/mortbay/util/Attributes
358, H1, FAILURE, falcon-common: There are test failures.
359, H1, FAILURE, falcon-webapp: Execution start-jetty:6.1.26:run failed: A required class
was missing while executing org.mortbay.jetty:maven-jetty-plugin:6.1.26:run: org/mortbay/util/Attributes
360, H3, FAILURE, falcon-webapp: Execution start-jetty:6.1.26:run failed: A required class
was missing while executing org.mortbay.jetty:maven-jetty-plugin:6.1.26:run: org/mortbay/util/Attributes
361, H1, FAILURE, falcon-webapp: Execution start-jetty:6.1.26:run failed: A required class
was missing while executing org.mortbay.jetty:maven-jetty-plugin:6.1.26:run: org/mortbay/util/Attributes
362, H4, FAILURE, falcon-webapp: Execution start-jetty:6.1.26:run failed: A required class
was missing while executing org.mortbay.jetty:maven-jetty-plugin:6.1.26:run: org/mortbay/util/Attributes
363, H3, FAILURE, falcon-webapp: Execution start-jetty:6.1.26:run failed: A required class
was missing while executing org.mortbay.jetty:maven-jetty-plugin:6.1.26:run: org/mortbay/util/Attributes
364, H3, FAILURE, falcon-webapp: Execution start-jetty:6.1.26:run failed: A required class
was missing while executing org.mortbay.jetty:maven-jetty-plugin:6.1.26:run: org/mortbay/util/Attributes
365, H4, FAILURE, falcon-webapp: Execution start-jetty:6.1.26:run failed: A required class
was missing while executing org.mortbay.jetty:maven-jetty-plugin:6.1.26:run: org/mortbay/util/Attributes
366, H1, FAILURE, falcon-webapp: Execution start-jetty:6.1.26:run failed: A required class
was missing while executing org.mortbay.jetty:maven-jetty-plugin:6.1.26:run: org/mortbay/util/Attributes
367, H0, FAILURE, falcon-webapp: Failure: Address already in use -> [Help 1]
368, H0, FAILURE, falcon-webapp: Failure: Address already in use -> [Help 1]
369, H4, 662),
370, H3, FAILURE, falcon-webapp: Execution start-jetty:6.1.26:run failed: A required class
was missing while executing org.mortbay.jetty:maven-jetty-plugin:6.1.26:run: org/mortbay/util/Attributes
371, H4, FAILURE, falcon-webapp: Execution start-jetty:6.1.26:run failed: A required class
was missing while executing org.mortbay.jetty:maven-jetty-plugin:6.1.26:run: org/mortbay/util/Attributes
372, H0, SUCCESS,
373, H4, FAILURE, falcon-webapp: Execution start-jetty:6.1.26:run failed: A required class
was missing while executing org.mortbay.jetty:maven-jetty-plugin:6.1.26:run: org/mortbay/util/Attributes
374, H3, FAILURE, falcon-webapp: Execution start-jetty:6.1.26:run failed: A required class
was missing while executing org.mortbay.jetty:maven-jetty-plugin:6.1.26:run: org/mortbay/util/Attributes
375, H3, FAILURE, falcon-webapp: Execution start-jetty:6.1.26:run failed: A required class
was missing while executing org.mortbay.jetty:maven-jetty-plugin:6.1.26:run: org/mortbay/util/Attributes
376, H4, FAILURE, falcon-webapp: Execution start-jetty:6.1.26:run failed: A required class
was missing while executing org.mortbay.jetty:maven-jetty-plugin:6.1.26:run: org/mortbay/util/Attributes
377, H0, SUCCESS,
378, H5, FAILURE, falcon-webapp: Execution start-jetty:6.1.26:run failed: A required class
was missing while executing org.mortbay.jetty:maven-jetty-plugin:6.1.26:run: org/mortbay/util/Attributes
379, H5, FAILURE, falcon-prism: There are test failures.
380, H0, FAILURE, falcon-webapp: There are test failures.
381, H5, FAILURE, falcon-webapp: Execution start-jetty:6.1.26:run failed: A required class
was missing while executing org.mortbay.jetty:maven-jetty-plugin:6.1.26:run: org/mortbay/util/Attributes
382, H1, FAILURE, falcon-webapp: Execution start-jetty:6.1.26:run failed: A required class
was missing while executing org.mortbay.jetty:maven-jetty-plugin:6.1.26:run: org/mortbay/util/Attributes
383, H8, FAILURE, falcon-webapp: Execution start-jetty:6.1.26:run failed: A required class
was missing while executing org.mortbay.jetty:maven-jetty-plugin:6.1.26:run: org/mortbay/util/Attributes
384, H8, FAILURE, falcon-webapp: Execution start-jetty:6.1.26:run failed: A required class
was missing while executing org.mortbay.jetty:maven-jetty-plugin:6.1.26:run: org/mortbay/util/Attributes
385, H1, FAILURE, falcon-webapp: Execution start-jetty:6.1.26:run failed: A required class
was missing while executing org.mortbay.jetty:maven-jetty-plugin:6.1.26:run: org/mortbay/util/Attributes
386, H8, FAILURE, falcon-oozie-adaptor: There are test failures.
387, H8, FAILURE, falcon-common: There are test failures.
388, H8, FAILURE, falcon-webapp: Execution start-jetty:6.1.26:run failed: A required class
was missing while executing org.mortbay.jetty:maven-jetty-plugin:6.1.26:run: org/mortbay/util/Attributes
389, H8, FAILURE, falcon-common: There are test failures.
390, H8, FAILURE, falcon-common: There are test failures.
391, H4, FAILURE, falcon-common: There are test failures.
392, H4, FAILURE, falcon-common: There are test failures.
393, H4, FAILURE, falcon-common: There are test failures.
394, H5, FAILURE, falcon-common: There are test failures.
395, H8, FAILURE, falcon-webapp: Execution start-jetty:6.1.26:run failed: A required class
was missing while executing org.mortbay.jetty:maven-jetty-plugin:6.1.26:run: org/mortbay/util/Attributes
396, H8, FAILURE, falcon-common: You have 1 Checkstyle violation. -> [Help 1]
397, H7, FAILURE, falcon-webapp: Execution start-jetty:6.1.26:run failed: A required class
was missing while executing org.mortbay.jetty:maven-jetty-plugin:6.1.26:run: org/mortbay/util/Attributes
398, H8, FAILURE, falcon-webapp: Execution start-jetty:6.1.26:run failed: A required class
was missing while executing org.mortbay.jetty:maven-jetty-plugin:6.1.26:run: org/mortbay/util/Attributes
399, H8, FAILURE, falcon-webapp: Execution start-jetty:6.1.26:run failed: A required class
was missing while executing org.mortbay.jetty:maven-jetty-plugin:6.1.26:run: org/mortbay/util/Attributes
400, H4, FAILURE, falcon-webapp: Execution start-jetty:6.1.26:run failed: A required class
was missing while executing org.mortbay.jetty:maven-jetty-plugin:6.1.26:run: org/mortbay/util/Attributes
401, H3, FAILURE, falcon-webapp: Execution start-jetty:6.1.26:run failed: A required class
was missing while executing org.mortbay.jetty:maven-jetty-plugin:6.1.26:run: org/mortbay/util/Attributes
402, H8, FAILURE, falcon-webapp: Execution start-jetty:6.1.26:run failed: A required class
was missing while executing org.mortbay.jetty:maven-jetty-plugin:6.1.26:run: org/mortbay/util/Attributes
403, H4, FAILURE, falcon-webapp: Execution start-jetty:6.1.26:run failed: A required class
was missing while executing org.mortbay.jetty:maven-jetty-plugin:6.1.26:run: org/mortbay/util/Attributes
404, H8, SUCCESS,
405, H4, FAILURE, falcon-webapp: Execution start-jetty:6.1.26:run failed: A required class
was missing while executing org.mortbay.jetty:maven-jetty-plugin:6.1.26:run: org/mortbay/util/Attributes
{noformat}


> failed: A required class was missing while executing org.mortbay.jetty:maven-jetty-plugin:6.1.26:run:
org/mortbay/util/Attributes
> ---------------------------------------------------------------------------------------------------------------------------------
>
>                 Key: FALCON-328
>                 URL: https://issues.apache.org/jira/browse/FALCON-328
>             Project: Falcon
>          Issue Type: Bug
>          Components: webapp
>         Environment: Cent OS - Linux localhost.localdomain 2.6.32-431.5.1.el6.x86_64
#1 SMP Wed Feb 12 00:41:43 UTC 2014 x86_64 x86_64 x86_64 GNU/Linux
> [admin@localhost ~]$ mvn -v
> Apache Maven 3.0.5 (r01de14724cdef164cd33c7c8c2fe155faf9602da; 2013-02-19 08:51:28-0500)
> Maven home: /opt/maven
> Java version: 1.6.0_30, vendor: Sun Microsystems Inc.
> Java home: /usr/lib/jvm/java-1.6.0-openjdk-1.6.0.0.x86_64/jre
> Default locale: en_US, platform encoding: UTF-8
> OS name: "linux", version: "2.6.32-431.5.1.el6.x86_64", arch: "amd64", family: "unix"
> [admin@localhost ~]$
>            Reporter: Vijayakumar Ramdoss
>            Assignee: Jean-Baptiste Onofré
>            Priority: Trivial
>              Labels: build
>   Original Estimate: 1h
>  Remaining Estimate: 1h
>
> While building the Falcon from my CentOS system, its throwing the error message as like
this,
> java.lang.NoClassDefFoundError: org/mortbay/util/Attributes
>                 at java.lang.ClassLoader.defineClass1(Native Method)
>                 at java.lang.ClassLoader.defineClass(ClassLoader.java:643)
>                 at java.security.SecureClassLoader.defineClass(SecureClassLoader.java:142)
>                 at java.net.URLClassLoader.defineClass(URLClassLoader.java:277)
>                 at java.net.URLClassLoader.access$000(URLClassLoader.java:73)
>                 at java.net.URLClassLoader$1.run(URLClassLoader.java:212)
>                 at java.security.AccessController.doPrivileged(Native Method)
>                 at java.net.URLClassLoader.findClass(URLClassLoader.java:205)
>                 at org.codehaus.plexus.classworlds.realm.ClassRealm.loadClassFromSelf(ClassReal
m.java:389)
>                 at org.codehaus.plexus.classworlds.strategy.SelfFirstStrategy.loadClass(SelfFir
stStrategy.java:42)
>                 at org.codehaus.plexus.classworlds.realm.ClassRealm.unsynchronizedLoadClass(Cla
s
> Please refer the detailed error message from here,
> https://onedrive.live.com/redir?resid=BAB25DA19231794A!1782&authkey=!ALnerkhGzhw3Ukw&ithint=file%2c.gz



--
This message was sent by Atlassian JIRA
(v6.3.4#6332)

Mime
View raw message