falcon-dev mailing list archives

Site index · List index
Message view « Date » · « Thread »
Top « Date » · « Thread »
From Apache Jenkins Server <jenk...@builds.apache.org>
Subject Build failed in Jenkins: Apache-falcon #393
Date Tue, 02 Sep 2014 00:26:00 GMT
See <https://builds.apache.org/job/Apache-falcon/393/changes>

Changes:

[rostafiychuk] FALCON-587 Don't delete input data in @AfterClass in falcon-regression tests
if clean_test_dir=false

[rostafiychuk] FALCON-655 Skip workflow upload if process won't be submitted

------------------------------------------
[...truncated 799 lines...]
Downloading: http://repository.codehaus.org/asm/asm/maven-metadata.xml
Downloading: https://raw.github.com/InMobi/mvn-repo/master/releases/asm/asm/maven-metadata.xml
898/898 B   
            
Downloaded: http://repo1.maven.org/maven2/asm/asm/maven-metadata.xml (898 B at 2.6 KB/sec)
Downloading: https://repository.apache.org/content/groups/snapshots/asm/asm/maven-metadata.xml
            
Downloading: https://repository.apache.org/content/groups/public/asm/asm/maven-metadata.xml
            
Downloading: https://maven.java.net/content/groups/public/asm/asm/maven-metadata.xml
            
            
Downloading: https://repository.jboss.org/nexus/content/groups/public/asm/asm/maven-metadata.xml
Downloading: https://repository.cloudera.com/artifactory/cloudera-repos/asm/asm/maven-metadata.xml
            
Downloading: http://repository.apache.org/snapshots/asm/asm/maven-metadata.xml
            
Downloading: http://www.datanucleus.org/downloads/maven2/asm/asm/maven-metadata.xml
            
Downloading: http://www.datanucleus.org/downloads/maven2/asm/asm/maven-metadata.xml
            
925/925 B   
            
Downloaded: https://repository.jboss.org/nexus/content/groups/public/asm/asm/maven-metadata.xml
(925 B at 1.6 KB/sec)
            
            
[WARNING] Could not transfer metadata asm:asm/maven-metadata.xml from/to local.repository
(file:../../local.repository/trunk): No connector available to access repository local.repository
(file:../../local.repository/trunk) of type legacy using the available factories WagonRepositoryConnectorFactory
[INFO] 
[INFO] --- maven-clean-plugin:2.5:clean (default-clean) @ falcon-common ---
[INFO] Deleting <https://builds.apache.org/job/Apache-falcon/ws/common/target>
[INFO] 
[INFO] --- maven-enforcer-plugin:1.3.1:enforce (enforce-property) @ falcon-common ---
[INFO] 
[INFO] --- buildnumber-maven-plugin:1.0:create (default) @ falcon-common ---
[INFO] Checking for local modifications: skipped.
[INFO] Updating project files from SCM: skipped.
[INFO] Executing: /bin/sh -c cd <https://builds.apache.org/job/Apache-falcon/ws/common>
&& git show
[INFO] Working directory: <https://builds.apache.org/job/Apache-falcon/ws/common>
[INFO] Storing buildNumber: d74dc3221f25ff99156a6b2a0aa1e8cd94d6c0f9 at timestamp: 1409617497772
[INFO] Executing: /bin/sh -c cd <https://builds.apache.org/job/Apache-falcon/ws/common>
&& git show
[INFO] Working directory: <https://builds.apache.org/job/Apache-falcon/ws/common>
[INFO] Storing buildScmBranch: UNKNOWN
[INFO] 
[INFO] --- maven-remote-resources-plugin:1.4:process (default) @ falcon-common ---
[INFO] artifact asm:asm: checking for updates from central
[INFO] artifact asm:asm: checking for updates from im
[INFO] artifact asm:asm: checking for updates from hortonworks.repo
[INFO] artifact asm:asm: checking for updates from Codehaus repository
[INFO] artifact asm:asm: checking for updates from apache.snapshots.repo
[INFO] artifact asm:asm: checking for updates from default
[INFO] artifact asm:asm: checking for updates from java.net-Public
[INFO] artifact asm:asm: checking for updates from repository.jboss.org-public
[INFO] artifact asm:asm: checking for updates from cdh.repo
[INFO] artifact asm:asm: checking for updates from datanucleus
[INFO] artifact asm:asm: checking for updates from local.repository
[INFO] artifact asm:asm: checking for updates from DN_M2_Repo
[INFO] 
[INFO] --- maven-resources-plugin:2.6:resources (default-resources) @ falcon-common ---
[INFO] Using 'UTF-8' encoding to copy filtered resources.
[INFO] Copying 0 resource
[INFO] Copying 3 resources
[INFO] Copying 0 resource
[INFO] Copying 2 resources to META-INF
[INFO] Copying 3 resources
[INFO] 
[INFO] --- maven-compiler-plugin:2.3.2:compile (default-compile) @ falcon-common ---
[INFO] Compiling 72 source files to <https://builds.apache.org/job/Apache-falcon/ws/common/target/classes>
[INFO] 
[INFO] --- maven-resources-plugin:2.6:testResources (default-testResources) @ falcon-common
---
[INFO] Using 'UTF-8' encoding to copy filtered resources.
[INFO] Copying 18 resources
[INFO] Copying 3 resources
[INFO] 
[INFO] --- maven-compiler-plugin:2.3.2:testCompile (default-testCompile) @ falcon-common ---
[INFO] Compiling 28 source files to <https://builds.apache.org/job/Apache-falcon/ws/common/target/test-classes>
[INFO] 
[INFO] --- maven-surefire-plugin:2.16:test (default-test) @ falcon-common ---
[WARNING] The parameter forkMode is deprecated since version 2.14. Use forkCount and reuseForks
instead.
[INFO] Surefire report directory: <https://builds.apache.org/job/Apache-falcon/ws/common/target/surefire-reports>

-------------------------------------------------------
 T E S T S
-------------------------------------------------------

-------------------------------------------------------
 T E S T S
-------------------------------------------------------
Running org.apache.falcon.hadoop.HadoopClientFactoryTest
Tests run: 3, Failures: 0, Errors: 0, Skipped: 0, Time elapsed: 0.623 sec - in org.apache.falcon.hadoop.HadoopClientFactoryTest
Running org.apache.falcon.util.ReflectionUtilsTest
Tests run: 1, Failures: 0, Errors: 0, Skipped: 0, Time elapsed: 0.825 sec - in org.apache.falcon.util.ReflectionUtilsTest
Running org.apache.falcon.util.ApplicationPropertiesTest
Tests run: 3, Failures: 0, Errors: 0, Skipped: 0, Time elapsed: 0.442 sec - in org.apache.falcon.util.ApplicationPropertiesTest
Running org.apache.falcon.entity.TestWorkflowNameBuilder
Tests run: 3, Failures: 0, Errors: 0, Skipped: 0, Time elapsed: 0.738 sec - in org.apache.falcon.entity.TestWorkflowNameBuilder
Running org.apache.falcon.entity.CatalogStorageTest
Tests run: 17, Failures: 0, Errors: 0, Skipped: 0, Time elapsed: 0.389 sec - in org.apache.falcon.entity.CatalogStorageTest
Running org.apache.falcon.entity.parser.ClusterEntityParserTest
Tests run: 6, Failures: 0, Errors: 0, Skipped: 0, Time elapsed: 1.242 sec - in org.apache.falcon.entity.parser.ClusterEntityParserTest
Running org.apache.falcon.entity.parser.ProcessEntityParserTest
Tests run: 26, Failures: 0, Errors: 0, Skipped: 0, Time elapsed: 3.446 sec - in org.apache.falcon.entity.parser.ProcessEntityParserTest
Running org.apache.falcon.entity.parser.FeedEntityParserTest
Tests run: 32, Failures: 0, Errors: 0, Skipped: 0, Time elapsed: 2.981 sec - in org.apache.falcon.entity.parser.FeedEntityParserTest
Running org.apache.falcon.entity.parser.FeedUpdateTest
Tests run: 4, Failures: 0, Errors: 0, Skipped: 0, Time elapsed: 1.51 sec - in org.apache.falcon.entity.parser.FeedUpdateTest
Running org.apache.falcon.entity.EntityUtilTest
Tests run: 16, Failures: 1, Errors: 0, Skipped: 0, Time elapsed: 1.397 sec <<< FAILURE!
- in org.apache.falcon.entity.EntityUtilTest
testGetEntityStartEndDates(org.apache.falcon.entity.EntityUtilTest)  Time elapsed: 0.015 sec
 <<< FAILURE!
java.lang.AssertionError: expected:<Sat Dec 29 16:00:00 PST 2091> but was:<Sun Dec
30 00:00:00 UTC 2091>
	at org.testng.Assert.fail(Assert.java:89)
	at org.testng.Assert.failNotEquals(Assert.java:489)
	at org.testng.Assert.assertEquals(Assert.java:118)
	at org.testng.Assert.assertEquals(Assert.java:171)
	at org.testng.Assert.assertEquals(Assert.java:181)
	at org.apache.falcon.entity.EntityUtilTest.testGetEntityStartEndDates(EntityUtilTest.java:228)

Running org.apache.falcon.entity.store.ConfigurationStoreTest
Tests run: 15, Failures: 0, Errors: 0, Skipped: 0, Time elapsed: 1.209 sec - in org.apache.falcon.entity.store.ConfigurationStoreTest
Running org.apache.falcon.entity.FileSystemStorageTest
Tests run: 35, Failures: 0, Errors: 0, Skipped: 0, Time elapsed: 0.962 sec - in org.apache.falcon.entity.FileSystemStorageTest
Running org.apache.falcon.entity.ColoClusterRelationTest
Tests run: 1, Failures: 0, Errors: 0, Skipped: 0, Time elapsed: 1.115 sec - in org.apache.falcon.entity.ColoClusterRelationTest
Running org.apache.falcon.entity.FeedHelperTest
Tests run: 2, Failures: 0, Errors: 0, Skipped: 0, Time elapsed: 0.294 sec - in org.apache.falcon.entity.FeedHelperTest
Running org.apache.falcon.entity.StorageFactoryTest
Tests run: 36, Failures: 0, Errors: 0, Skipped: 0, Time elapsed: 1.42 sec - in org.apache.falcon.entity.StorageFactoryTest
Running org.apache.falcon.entity.v0.EntityGraphTest
Tests run: 4, Failures: 0, Errors: 0, Skipped: 0, Time elapsed: 1.149 sec - in org.apache.falcon.entity.v0.EntityGraphTest
Running org.apache.falcon.entity.EntityTypeTest
Tests run: 2, Failures: 0, Errors: 0, Skipped: 0, Time elapsed: 0.679 sec - in org.apache.falcon.entity.EntityTypeTest
Running org.apache.falcon.metadata.MetadataMappingServiceTest
Tests run: 11, Failures: 0, Errors: 0, Skipped: 0, Time elapsed: 4.944 sec - in org.apache.falcon.metadata.MetadataMappingServiceTest
Running org.apache.falcon.group.FeedGroupMapTest
Tests run: 3, Failures: 0, Errors: 0, Skipped: 0, Time elapsed: 1.24 sec - in org.apache.falcon.group.FeedGroupMapTest
Running org.apache.falcon.update.UpdateHelperTest
Tests run: 5, Failures: 0, Errors: 0, Skipped: 0, Time elapsed: 2.646 sec - in org.apache.falcon.update.UpdateHelperTest
Running org.apache.falcon.security.SecurityUtilTest
Tests run: 7, Failures: 0, Errors: 0, Skipped: 0, Time elapsed: 0.408 sec - in org.apache.falcon.security.SecurityUtilTest
Running org.apache.falcon.security.CurrentUserTest
Tests run: 11, Failures: 0, Errors: 0, Skipped: 0, Time elapsed: 0.525 sec - in org.apache.falcon.security.CurrentUserTest
Running org.apache.falcon.security.AuthenticationInitializationServiceTest
Tests run: 5, Failures: 0, Errors: 0, Skipped: 0, Time elapsed: 0.707 sec - in org.apache.falcon.security.AuthenticationInitializationServiceTest
Running org.apache.falcon.security.DefaultAuthorizationProviderTest
Tests run: 34, Failures: 0, Errors: 0, Skipped: 0, Time elapsed: 1.359 sec - in org.apache.falcon.security.DefaultAuthorizationProviderTest
Running org.apache.falcon.workflow.WorkflowExecutionContextTest
Tests run: 37, Failures: 0, Errors: 0, Skipped: 0, Time elapsed: 1.042 sec - in org.apache.falcon.workflow.WorkflowExecutionContextTest
Running org.apache.falcon.workflow.WorkflowJobEndNotificationServiceTest
Tests run: 2, Failures: 0, Errors: 0, Skipped: 0, Time elapsed: 0.436 sec - in org.apache.falcon.workflow.WorkflowJobEndNotificationServiceTest
Running org.apache.falcon.cleanup.LogCleanupServiceTest
Tests run: 1, Failures: 0, Errors: 0, Skipped: 0, Time elapsed: 2.559 sec - in org.apache.falcon.cleanup.LogCleanupServiceTest

Results :

Failed tests: 
  EntityUtilTest.testGetEntityStartEndDates:228 expected:<Sat Dec 29 16:00:00 PST 2091>
but was:<Sun Dec 30 00:00:00 UTC 2091>

Tests run: 322, Failures: 1, Errors: 0, Skipped: 0

[INFO] ------------------------------------------------------------------------
[INFO] Reactor Summary:
[INFO] 
[INFO] Checkstyle ........................................ SUCCESS [  0.959 s]
[INFO] Apache Falcon ..................................... SUCCESS [  4.670 s]
[INFO] Build Tools ....................................... SUCCESS [  3.772 s]
[INFO] Apache Falcon CLI client .......................... SUCCESS [ 29.550 s]
[INFO] Apache Falcon Metrics ............................. SUCCESS [  9.947 s]
[INFO] Apache Falcon Hadoop Dependencies ................. SUCCESS [ 10.876 s]
[INFO] Apache Falcon Test Utility ........................ SUCCESS [  9.998 s]
[INFO] Apache Falcon Commons ............................. FAILURE [ 53.107 s]
[INFO] Apache Falcon Oozie EL Extension .................. SKIPPED
[INFO] Apache Falcon Embedded Hadoop - Test Cluster ...... SKIPPED
[INFO] Apache Falcon Messaging ........................... SKIPPED
[INFO] Apache Falcon Oozie Adaptor ....................... SKIPPED
[INFO] Apache Falcon Acquisition ......................... SKIPPED
[INFO] Apache Falcon Replication ......................... SKIPPED
[INFO] Apache Falcon Retention ........................... SKIPPED
[INFO] Apache Falcon Archival ............................ SKIPPED
[INFO] Apache Falcon Rerun ............................... SKIPPED
[INFO] Apache Falcon Prism ............................... SKIPPED
[INFO] Apache Falcon Web Application ..................... SKIPPED
[INFO] Apache Falcon Documentation ....................... SKIPPED
[INFO] ------------------------------------------------------------------------
[INFO] BUILD FAILURE
[INFO] ------------------------------------------------------------------------
[INFO] Total time: 02:03 min
[INFO] Finished at: 2014-09-02T00:25:48+00:00
[INFO] Final Memory: 82M/764M
[INFO] ------------------------------------------------------------------------
[ERROR] Failed to execute goal org.apache.maven.plugins:maven-surefire-plugin:2.16:test (default-test)
on project falcon-common: There are test failures.
[ERROR] 
[ERROR] Please refer to <https://builds.apache.org/job/Apache-falcon/ws/common/target/surefire-reports>
for the individual test results.
[ERROR] -> [Help 1]
[ERROR] 
[ERROR] To see the full stack trace of the errors, re-run Maven with the -e switch.
[ERROR] Re-run Maven using the -X switch to enable full debug logging.
[ERROR] 
[ERROR] For more information about the errors and possible solutions, please read the following
articles:
[ERROR] [Help 1] http://cwiki.apache.org/confluence/display/MAVEN/MojoFailureException
[ERROR] 
[ERROR] After correcting the problems, you can resume the build with the command
[ERROR]   mvn <goals> -rf :falcon-common
Build step 'Execute shell' marked build as failure
[CHECKSTYLE] Collecting checkstyle analysis files...
[CHECKSTYLE] Finding all files that match the pattern **/target/checkstyle-result.xml
[CHECKSTYLE] Parsing 16 files in <https://builds.apache.org/job/Apache-falcon/ws/>
[CHECKSTYLE] Successfully parsed file <https://builds.apache.org/job/Apache-falcon/ws/acquisition/target/checkstyle-result.xml>
of module  with 0 warnings.
[CHECKSTYLE] Successfully parsed file <https://builds.apache.org/job/Apache-falcon/ws/archival/target/checkstyle-result.xml>
of module  with 0 warnings.
[CHECKSTYLE] Successfully parsed file <https://builds.apache.org/job/Apache-falcon/ws/build-tools/target/checkstyle-result.xml>
of module  with 0 warnings.
[CHECKSTYLE] Successfully parsed file <https://builds.apache.org/job/Apache-falcon/ws/client/target/checkstyle-result.xml>
of module  with 0 warnings.
[CHECKSTYLE] Successfully parsed file <https://builds.apache.org/job/Apache-falcon/ws/hadoop-dependencies/target/checkstyle-result.xml>
of module  with 0 warnings.
[CHECKSTYLE] Successfully parsed file <https://builds.apache.org/job/Apache-falcon/ws/hadoop-webapp/target/checkstyle-result.xml>
of module  with 0 warnings.
[CHECKSTYLE] Successfully parsed file <https://builds.apache.org/job/Apache-falcon/ws/messaging/target/checkstyle-result.xml>
of module  with 0 warnings.
[CHECKSTYLE] Successfully parsed file <https://builds.apache.org/job/Apache-falcon/ws/metrics/target/checkstyle-result.xml>
of module  with 0 warnings.
[CHECKSTYLE] Successfully parsed file <https://builds.apache.org/job/Apache-falcon/ws/oozie-el-extensions/target/checkstyle-result.xml>
of module  with 0 warnings.
[CHECKSTYLE] Successfully parsed file <https://builds.apache.org/job/Apache-falcon/ws/oozie/target/checkstyle-result.xml>
of module  with 0 warnings.
[CHECKSTYLE] Successfully parsed file <https://builds.apache.org/job/Apache-falcon/ws/prism/target/checkstyle-result.xml>
of module  with 0 warnings.
[CHECKSTYLE] Successfully parsed file <https://builds.apache.org/job/Apache-falcon/ws/replication/target/checkstyle-result.xml>
of module  with 0 warnings.
[CHECKSTYLE] Successfully parsed file <https://builds.apache.org/job/Apache-falcon/ws/rerun/target/checkstyle-result.xml>
of module  with 0 warnings.
[CHECKSTYLE] Successfully parsed file <https://builds.apache.org/job/Apache-falcon/ws/retention/target/checkstyle-result.xml>
of module  with 0 warnings.
[CHECKSTYLE] Successfully parsed file <https://builds.apache.org/job/Apache-falcon/ws/target/checkstyle-result.xml>
of module  with 0 warnings.
[CHECKSTYLE] Successfully parsed file <https://builds.apache.org/job/Apache-falcon/ws/test-util/target/checkstyle-result.xml>
of module  with 0 warnings.
[CHECKSTYLE] Computing warning deltas based on reference build #377
[FINDBUGS] Collecting findbugs analysis files...
[FINDBUGS] Finding all files that match the pattern **/target/findbugs.xml
[FINDBUGS] Parsing 12 files in <https://builds.apache.org/job/Apache-falcon/ws/>
[FINDBUGS] Successfully parsed file <https://builds.apache.org/job/Apache-falcon/ws/client/target/findbugs.xml>
of module  with 0 warnings.
[FINDBUGS] Successfully parsed file <https://builds.apache.org/job/Apache-falcon/ws/hadoop-dependencies/target/findbugs.xml>
of module  with 0 warnings.
[FINDBUGS] Successfully parsed file <https://builds.apache.org/job/Apache-falcon/ws/hadoop-webapp/target/findbugs.xml>
of module  with 0 warnings.
[FINDBUGS] Successfully parsed file <https://builds.apache.org/job/Apache-falcon/ws/messaging/target/findbugs.xml>
of module  with 0 warnings.
[FINDBUGS] Successfully parsed file <https://builds.apache.org/job/Apache-falcon/ws/metrics/target/findbugs.xml>
of module  with 0 warnings.
[FINDBUGS] Successfully parsed file <https://builds.apache.org/job/Apache-falcon/ws/oozie-el-extensions/target/findbugs.xml>
of module  with 0 warnings.
[FINDBUGS] Successfully parsed file <https://builds.apache.org/job/Apache-falcon/ws/oozie/target/findbugs.xml>
of module  with 0 warnings.
[FINDBUGS] Successfully parsed file <https://builds.apache.org/job/Apache-falcon/ws/prism/target/findbugs.xml>
of module  with 0 warnings.
[FINDBUGS] Successfully parsed file <https://builds.apache.org/job/Apache-falcon/ws/replication/target/findbugs.xml>
of module  with 0 warnings.
[FINDBUGS] Successfully parsed file <https://builds.apache.org/job/Apache-falcon/ws/rerun/target/findbugs.xml>
of module  with 0 warnings.
[FINDBUGS] Successfully parsed file <https://builds.apache.org/job/Apache-falcon/ws/retention/target/findbugs.xml>
of module  with 0 warnings.
[FINDBUGS] Successfully parsed file <https://builds.apache.org/job/Apache-falcon/ws/test-util/target/findbugs.xml>
of module  with 0 warnings.
[FINDBUGS] Computing warning deltas based on reference build #377
Archiving artifacts
Sending artifact delta relative to Apache-falcon #377
Archived 9 artifacts
Archive block size is 32768
Received 0 blocks and 463945 bytes
Compression is 0.0%
Took 2.4 sec
Recording test results
TestNG Reports Processing: START
Looking for TestNG results report in workspace using pattern: **/target/testng-results.xml
Did not find any matching files.

Mime
View raw message