falcon-dev mailing list archives

Site index · List index
Message view « Date » · « Thread »
Top « Date » · « Thread »
From "Shwetha G S (JIRA)" <j...@apache.org>
Subject [jira] [Created] (FALCON-642) OozieProcessWorkflowBuilderTest test failures
Date Wed, 27 Aug 2014 03:22:57 GMT
Shwetha G S created FALCON-642:
----------------------------------

             Summary: OozieProcessWorkflowBuilderTest test failures
                 Key: FALCON-642
                 URL: https://issues.apache.org/jira/browse/FALCON-642
             Project: Falcon
          Issue Type: Bug
            Reporter: Shwetha G S
            Assignee: Shwetha G S
         Attachments: FALCON-642.patch

{noformat}
Running org.apache.falcon.oozie.process.OozieProcessWorkflowBuilderTest
Tests run: 17, Failures: 2, Errors: 0, Skipped: 0, Time elapsed: 7.529 sec <<< FAILURE!
- in org.apache.falcon.oozie.process.OozieProcessWorkflowBuilderTest
testProcessMapperForTableStorage(org.apache.falcon.oozie.process.OozieProcessWorkflowBuilderTest)
 Time elapsed: 0.207 sec  <<< FAILURE!
java.lang.AssertionError: expected:<input> but was:<null>
        at org.testng.Assert.fail(Assert.java:89)
        at org.testng.Assert.failNotEquals(Assert.java:489)
        at org.testng.Assert.assertEquals(Assert.java:118)
        at org.testng.Assert.assertEquals(Assert.java:171)
        at org.testng.Assert.assertEquals(Assert.java:181)
        at org.apache.falcon.oozie.process.OozieProcessWorkflowBuilderTest.testProcessMapperForTableStorage(OozieProcessWorkflowBuilderTest.java:564)

testProcessMapperForTableStorage(org.apache.falcon.oozie.process.OozieProcessWorkflowBuilderTest)
 Time elapsed: 0.207 sec  <<< FAILURE!
java.lang.AssertionError: expected:<input> but was:<null>
        at org.testng.Assert.fail(Assert.java:89)
        at org.testng.Assert.failNotEquals(Assert.java:489)
        at org.testng.Assert.assertEquals(Assert.java:118)
        at org.testng.Assert.assertEquals(Assert.java:171)
        at org.testng.Assert.assertEquals(Assert.java:181)
        at org.apache.falcon.oozie.process.OozieProcessWorkflowBuilderTest.testProcessMapperForTableStorage(OozieProcessWorkflowBuilderTest.java:564)
{noformat}



--
This message was sent by Atlassian JIRA
(v6.2#6252)

Mime
View raw message