falcon-dev mailing list archives

Site index · List index
Message view « Date » · « Thread »
Top « Date » · « Thread »
From "Samarth Gupta (JIRA)" <j...@apache.org>
Subject [jira] [Commented] (FALCON-564) fix pom files to make falcon-regression a module
Date Thu, 07 Aug 2014 07:17:16 GMT

    [ https://issues.apache.org/jira/browse/FALCON-564?page=com.atlassian.jira.plugin.system.issuetabpanels:comment-tabpanel&focusedCommentId=14088932#comment-14088932
] 

Samarth Gupta commented on FALCON-564:
--------------------------------------

[~raghavgautam] falcon regression is getting build post this change. i have reverted the patch
locally for continued development. pls check . 
Below is the error on running 
{code}
mvn clean -DskipTests -DskipCheck install -Phadoop-2
{code}

{code}
[INFO] Installing /Users/samarth.gupta/falcon/falconApache/falcon-regression/pom.xml to /Users/samarth.gupta/.m2/repository/org/apache/falcon/regression/falcon-regression/0.6-incubating-SNAPSHOT/falcon-regression-0.6-incubating-SNAPSHOT.pom
[INFO] Installing /Users/samarth.gupta/falcon/falconApache/falcon-regression/target/falcon-regression-0.6-incubating-SNAPSHOT-tests.jar
to /Users/samarth.gupta/.m2/repository/org/apache/falcon/regression/falcon-regression/0.6-incubating-SNAPSHOT/falcon-regression-0.6-incubating-SNAPSHOT-tests.jar
[INFO]                                                                         
[INFO] ------------------------------------------------------------------------
[INFO] Building Apache Falcon Regression Suite Core 0.6-incubating-SNAPSHOT
[INFO] ------------------------------------------------------------------------
[WARNING] The POM for org.apache.oozie:oozie-client:jar:4.0.1 is missing, no dependency information
available
[WARNING] The POM for org.apache.hive.hcatalog:hive-webhcat-java-client:jar:0.11.0 is missing,
no dependency information available
[WARNING] The POM for org.apache.hive.hcatalog:hive-hcatalog-core:jar:0.11.0 is missing, no
dependency information available
[INFO] ------------------------------------------------------------------------
[INFO] Reactor Summary:
[INFO] 
[INFO] Checkstyle ........................................ SUCCESS [5.778s]
[INFO] Apache Falcon Regression .......................... SUCCESS [20.093s]
[INFO] Apache Falcon Regression Suite Core ............... FAILURE [4.694s]
[INFO] Apache Falcon Regression Suite .................... SKIPPED
[INFO] ------------------------------------------------------------------------
[INFO] BUILD FAILURE
[INFO] ------------------------------------------------------------------------
[INFO] Total time: 31.424s
[INFO] Finished at: Thu Aug 07 12:37:18 GMT+05:30 2014
[INFO] Final Memory: 25M/81M
[INFO] ------------------------------------------------------------------------
[ERROR] Failed to execute goal on project falcon-merlin-core: Could not resolve dependencies
for project org.apache.falcon.regression:falcon-merlin-core:jar:0.6-incubating-SNAPSHOT: The
following artifacts could not be resolved: org.apache.oozie:oozie-client:jar:4.0.1, org.apache.hive.hcatalog:hive-webhcat-java-client:jar:0.11.0,
org.apache.hive.hcatalog:hive-hcatalog-core:jar:0.11.0: Failure to find org.apache.oozie:oozie-client:jar:4.0.1
in http://maven.scm.corp.inmobi.com/content/groups/public/ was cached in the local repository,
resolution will not be reattempted until the update interval of public has elapsed or updates
are forced -> [Help 1]
[ERROR] 
[ERROR] To see the full stack trace of the errors, re-run Maven with the -e switch.
[ERROR] Re-run Maven using the -X switch to enable full debug logging.
[ERROR] 
[ERROR] For more information about the errors and possible solutions, please read the following
articles:
[ERROR] [Help 1] http://cwiki.apache.org/confluence/display/MAVEN/DependencyResolutionException
[ERROR] 
[ERROR] After correcting the problems, you can resume the build with the command
{code}

> fix pom files to make falcon-regression a module
> ------------------------------------------------
>
>                 Key: FALCON-564
>                 URL: https://issues.apache.org/jira/browse/FALCON-564
>             Project: Falcon
>          Issue Type: Bug
>          Components: merlin
>            Reporter: Raghav Kumar Gautam
>            Assignee: Raghav Kumar Gautam
>         Attachments: falcon-564-2.patch, falcon-564.patch
>
>




--
This message was sent by Atlassian JIRA
(v6.2#6252)

Mime
View raw message