falcon-dev mailing list archives

Site index · List index
Message view « Date » · « Thread »
Top « Date » · « Thread »
From Apache Jenkins Server <jenk...@builds.apache.org>
Subject Build failed in Jenkins: Apache-falcon #356
Date Tue, 29 Jul 2014 01:08:28 GMT
See <https://builds.apache.org/job/Apache-falcon/356/>

------------------------------------------
[...truncated 28951 lines...]
1003/1003 KB   1636/1636 KB   
1003/1003 KB   1636/1636 KB   
                              
Downloaded: http://repo.maven.apache.org/maven2/org/mortbay/jetty/jsp-2.1-glassfish/2.1.v20091210/jsp-2.1-glassfish-2.1.v20091210.jar
(1003 KB at 2279.0 KB/sec)
                              
Downloaded: http://repo.maven.apache.org/maven2/org/eclipse/jdt/core/compiler/ecj/3.5.1/ecj-3.5.1.jar
(1636 KB at 3563.1 KB/sec)
[INFO] Configuring Jetty for project: Apache Falcon Web Application
[INFO] Webapp source directory = <https://builds.apache.org/job/Apache-falcon/ws/webapp/src/main/webapp>
[INFO] Reload Mechanic: automatic
[INFO] Classes = <https://builds.apache.org/job/Apache-falcon/ws/webapp/target/classes>
[INFO] Logging to org.slf4j.impl.SimpleLogger(org.mortbay.log) via org.mortbay.log.Slf4jLog
[INFO] Context path = /falcon-webapp
[INFO] Tmp directory =  determined at runtime
[INFO] Web defaults = org/mortbay/jetty/webapp/webdefault.xml
[INFO] Web overrides =  none
[INFO] Adding overlay: jar:<https://builds.apache.org/job/Apache-falcon/ws/hadoop-webapp/target/falcon-hadoop-webapp-0.6-incubating-SNAPSHOT.war!/>
[INFO] web.xml file = <https://builds.apache.org/job/Apache-falcon/ws/webapp/src/main/webapp/WEB-INF/web.xml>
[INFO] Webapp directory = <https://builds.apache.org/job/Apache-falcon/ws/webapp/src/main/webapp>
[INFO] Starting jetty 6.1.26 ...
[INFO] jetty-6.1.26
SLF4J: Class path contains multiple SLF4J bindings.
SLF4J: Found binding in [jar:<https://builds.apache.org/job/Apache-falcon/ws/webapp/target/work/lib/Jetty-5509584740515271816.jar!/org/slf4j/impl/StaticLoggerBinder.class]>
SLF4J: Found binding in [jar:file:/home/jenkins/.m2/repository/org/slf4j/slf4j-log4j12/1.7.5/slf4j-log4j12-1.7.5.jar!/org/slf4j/impl/StaticLoggerBinder.class]
SLF4J: See http://www.slf4j.org/codes.html#multiple_bindings for an explanation.
SLF4J: Actual binding is of type [org.slf4j.impl.Log4jLoggerFactory]
[INFO] No Transaction manager found - if your webapp requires one, please configure one.
Jul 29, 2014 12:56:36 AM com.sun.jersey.api.core.PackagesResourceConfig init
INFO: Scanning for root resource and provider classes in the packages:
  org.apache.falcon.resource.admin
  org.apache.falcon.resource.proxy
  org.apache.falcon.resource.provider
  org.apache.falcon.resource.metadata
Jul 29, 2014 12:56:36 AM com.sun.jersey.api.core.ScanningResourceConfig logClasses
INFO: Root resource classes found:
  class org.apache.falcon.resource.proxy.SchedulableEntityManagerProxy
  class org.apache.falcon.resource.metadata.LineageMetadataResource
  class org.apache.falcon.resource.proxy.InstanceManagerProxy
  class org.apache.falcon.resource.admin.AdminResource
Jul 29, 2014 12:56:36 AM com.sun.jersey.api.core.ScanningResourceConfig logClasses
INFO: Provider classes found:
  class org.apache.falcon.resource.provider.JAXBContextResolver
Jul 29, 2014 12:56:36 AM com.sun.jersey.server.impl.application.WebApplicationImpl _initiate
INFO: Initiating Jersey application, version 'Jersey: 1.9 09/02/2011 11:17 AM'
[INFO] Extract <https://builds.apache.org/job/Apache-falcon/ws/webapp/target/webapps/oozie.war>
to /tmp/Jetty_0_0_0_0_41443_oozie.war__oozie__.lf8rot/webapp
log4j:WARN No appenders could be found for logger (oozieops).
log4j:WARN Please initialize the log4j system properly.
log4j:WARN See http://logging.apache.org/log4j/1.2/faq.html#noconfig for more info.
SLF4J: Class path contains multiple SLF4J bindings.
SLF4J: Found binding in [jar:file:/tmp/Jetty_0_0_0_0_41443_oozie.war__oozie__.lf8rot/webapp/WEB-INF/lib/slf4j-log4j12-1.7.5.jar!/org/slf4j/impl/StaticLoggerBinder.class]
SLF4J: Found binding in [jar:file:/tmp/Jetty_0_0_0_0_41443_oozie.war__oozie__.lf8rot/webapp/WEB-INF/lib/slf4j-log4j12-1.6.6.jar!/org/slf4j/impl/StaticLoggerBinder.class]
SLF4J: Found binding in [jar:file:/tmp/Jetty_0_0_0_0_41443_oozie.war__oozie__.lf8rot/webapp/WEB-INF/lib/slf4j-simple-1.6.6.jar!/org/slf4j/impl/StaticLoggerBinder.class]
SLF4J: See http://www.slf4j.org/codes.html#multiple_bindings for an explanation.
SLF4J: Actual binding is of type [org.slf4j.impl.Log4jLoggerFactory]
[WARNING] PWC6183: Invalid PUBLIC ID: null
[INFO] Extract <https://builds.apache.org/job/Apache-falcon/ws/webapp/target/webapps/hadoop.war>
to /tmp/Jetty_0_0_0_0_41443_hadoop.war__hadoop__.nyu8ob/webapp
[INFO] Started SslSocketConnector@0.0.0.0:41443
[INFO] Started SelectChannelConnector@0.0.0.0:41000
[INFO] Started Jetty Server
[INFO] 
[INFO] --- maven-failsafe-plugin:2.16:integration-test (integration-test) @ falcon-webapp
---
[WARNING] The parameter forkMode is deprecated since version 2.14. Use forkCount and reuseForks
instead.
[INFO] Failsafe report directory: <https://builds.apache.org/job/Apache-falcon/ws/webapp/target/failsafe-reports>

-------------------------------------------------------
 T E S T S
-------------------------------------------------------

-------------------------------------------------------
 T E S T S
-------------------------------------------------------
Starting hive metastore on port 49083
Running org.apache.falcon.validation.FeedEntityValidationIT
Tests run: 8, Failures: 0, Errors: 0, Skipped: 0, Time elapsed: 12.168 sec - in org.apache.falcon.validation.FeedEntityValidationIT
Running org.apache.falcon.validation.ClusterEntityValidationIT
Tests run: 12, Failures: 0, Errors: 0, Skipped: 0, Time elapsed: 9.659 sec - in org.apache.falcon.validation.ClusterEntityValidationIT
Running org.apache.falcon.resource.ProcessInstanceManagerIT
Tests run: 0, Failures: 0, Errors: 0, Skipped: 0, Time elapsed: 0.278 sec - in org.apache.falcon.resource.ProcessInstanceManagerIT
Running org.apache.falcon.resource.EntityManagerJerseyIT
Tests run: 22, Failures: 1, Errors: 0, Skipped: 0, Time elapsed: 42.884 sec <<< FAILURE!
- in org.apache.falcon.resource.EntityManagerJerseyIT
testProcessInputUpdate(org.apache.falcon.resource.EntityManagerJerseyIT)  Time elapsed: 4.624
sec  <<< FAILURE!
java.lang.IndexOutOfBoundsException: Index: 0, Size: 0
	at java.util.ArrayList.RangeCheck(ArrayList.java:547)
	at java.util.ArrayList.get(ArrayList.java:322)
	at org.apache.falcon.resource.EntityManagerJerseyIT.testProcessInputUpdate(EntityManagerJerseyIT.java:321)

Running org.apache.falcon.resource.EntityManagerJerseySmokeIT
Tests run: 2, Failures: 0, Errors: 0, Skipped: 0, Time elapsed: 6.789 sec - in org.apache.falcon.resource.EntityManagerJerseySmokeIT
Running org.apache.falcon.lifecycle.TableStorageFeedEvictorIT
Tests run: 20, Failures: 0, Errors: 0, Skipped: 0, Time elapsed: 26.925 sec - in org.apache.falcon.lifecycle.TableStorageFeedEvictorIT
Running org.apache.falcon.lifecycle.FileSystemFeedReplicationIT
Tests run: 0, Failures: 0, Errors: 0, Skipped: 0, Time elapsed: 2.81 sec - in org.apache.falcon.lifecycle.FileSystemFeedReplicationIT
Running org.apache.falcon.lifecycle.TableStorageFeedReplicationIT
Tests run: 0, Failures: 0, Errors: 0, Skipped: 0, Time elapsed: 2.096 sec - in org.apache.falcon.lifecycle.TableStorageFeedReplicationIT
Running org.apache.falcon.process.TableStorageProcessIT
Tests run: 0, Failures: 0, Errors: 0, Skipped: 0, Time elapsed: 1.852 sec - in org.apache.falcon.process.TableStorageProcessIT
Running org.apache.falcon.process.PigProcessIT
Tests run: 0, Failures: 0, Errors: 0, Skipped: 0, Time elapsed: 1.817 sec - in org.apache.falcon.process.PigProcessIT
Running org.apache.falcon.late.LateDataHandlerIT
Tests run: 2, Failures: 0, Errors: 0, Skipped: 0, Time elapsed: 8.801 sec - in org.apache.falcon.late.LateDataHandlerIT
Running org.apache.falcon.cli.FalconCLISmokeIT
Tests run: 1, Failures: 0, Errors: 0, Skipped: 0, Time elapsed: 9.122 sec - in org.apache.falcon.cli.FalconCLISmokeIT
Running org.apache.falcon.cli.FalconCLIIT
Tests run: 22, Failures: 0, Errors: 0, Skipped: 0, Time elapsed: 50.59 sec - in org.apache.falcon.cli.FalconCLIIT
Running org.apache.falcon.catalog.HiveCatalogServiceIT
Tests run: 24, Failures: 0, Errors: 0, Skipped: 0, Time elapsed: 15.69 sec - in org.apache.falcon.catalog.HiveCatalogServiceIT

Results :

Failed tests: 
  EntityManagerJerseyIT.testProcessInputUpdate:321 ? IndexOutOfBounds Index: 0, ...

Tests run: 113, Failures: 1, Errors: 0, Skipped: 0

[INFO] 
[INFO] --- maven-jetty-plugin:6.1.26:stop (stop-jetty) @ falcon-webapp ---
[INFO] 
[INFO] --- maven-failsafe-plugin:2.16:verify (verify) @ falcon-webapp ---
[INFO] Stopping server 0
[INFO] Stopped SelectChannelConnector@0.0.0.0:41000
[INFO] Stopped SslSocketConnector@0.0.0.0:41443
[INFO] Failsafe report directory: <https://builds.apache.org/job/Apache-falcon/ws/webapp/target/failsafe-reports>
[INFO] ------------------------------------------------------------------------
[INFO] Reactor Summary:
[INFO] 
[INFO] Checkstyle ........................................ SUCCESS [  1.162 s]
[INFO] Apache Falcon ..................................... SUCCESS [  6.143 s]
[INFO] Build Tools ....................................... SUCCESS [01:16 min]
[INFO] Apache Falcon CLI client .......................... SUCCESS [ 28.377 s]
[INFO] Apache Falcon Metrics ............................. SUCCESS [ 12.020 s]
[INFO] Apache Falcon Hadoop Dependencies ................. SUCCESS [ 12.204 s]
[INFO] Apache Falcon Test Utility ........................ SUCCESS [ 10.637 s]
[INFO] Apache Falcon Commons ............................. SUCCESS [01:30 min]
[INFO] Apache Falcon Oozie EL Extension .................. SUCCESS [ 15.245 s]
[INFO] Apache Falcon Embedded Hadoop - Test Cluster ...... SUCCESS [ 28.720 s]
[INFO] Apache Falcon Messaging ........................... SUCCESS [ 21.316 s]
[INFO] Apache Falcon Oozie Adaptor ....................... SUCCESS [ 47.702 s]
[INFO] Apache Falcon Acquisition ......................... SUCCESS [  0.541 s]
[INFO] Apache Falcon Replication ......................... SUCCESS [ 21.602 s]
[INFO] Apache Falcon Retention ........................... SUCCESS [ 17.569 s]
[INFO] Apache Falcon Archival ............................ SUCCESS [  0.675 s]
[INFO] Apache Falcon Rerun ............................... SUCCESS [ 26.432 s]
[INFO] Apache Falcon Prism ............................... SUCCESS [ 52.477 s]
[INFO] Apache Falcon Web Application ..................... FAILURE [03:45 min]
[INFO] Apache Falcon Documentation ....................... SKIPPED
[INFO] ------------------------------------------------------------------------
[INFO] BUILD FAILURE
[INFO] ------------------------------------------------------------------------
[INFO] Total time: 11:36 min
[INFO] Finished at: 2014-07-29T01:00:02+00:00
[INFO] Final Memory: 101M/907M
[INFO] ------------------------------------------------------------------------
[ERROR] Failed to execute goal org.apache.maven.plugins:maven-failsafe-plugin:2.16:verify
(verify) on project falcon-webapp: There are test failures.
[ERROR] 
[ERROR] Please refer to <https://builds.apache.org/job/Apache-falcon/ws/webapp/target/failsafe-reports>
for the individual test results.
[ERROR] -> [Help 1]
[ERROR] 
[ERROR] To see the full stack trace of the errors, re-run Maven with the -e switch.
[ERROR] Re-run Maven using the -X switch to enable full debug logging.
[ERROR] 
[ERROR] For more information about the errors and possible solutions, please read the following
articles:
[ERROR] [Help 1] http://cwiki.apache.org/confluence/display/MAVEN/MojoFailureException
[ERROR] 
[ERROR] After correcting the problems, you can resume the build with the command
[ERROR]   mvn <goals> -rf :falcon-webapp
[INFO] Shutdown hook executing
Shutting down hive metastore.
[INFO] Shutdown hook complete
Build step 'Execute shell' marked build as failure
[CHECKSTYLE] Collecting checkstyle analysis files...
[CHECKSTYLE] Finding all files that match the pattern **/target/checkstyle-result.xml
[CHECKSTYLE] Parsing 49 files in <https://builds.apache.org/job/Apache-falcon/ws/>
[CHECKSTYLE] Successfully parsed file <https://builds.apache.org/job/Apache-falcon/ws/acquisition/target/checkstyle-result.xml>
of module  with 0 warnings.
[CHECKSTYLE] Successfully parsed file <https://builds.apache.org/job/Apache-falcon/ws/archival/target/checkstyle-result.xml>
of module  with 0 warnings.
[CHECKSTYLE] Successfully parsed file <https://builds.apache.org/job/Apache-falcon/ws/build-tools/target/checkstyle-result.xml>
of module  with 0 warnings.
[CHECKSTYLE] Successfully parsed file <https://builds.apache.org/job/Apache-falcon/ws/client/target/checkstyle-result.xml>
of module  with 0 warnings.
[CHECKSTYLE] Successfully parsed file <https://builds.apache.org/job/Apache-falcon/ws/common/target/checkstyle-result.xml>
of module  with 0 warnings.
[CHECKSTYLE] Successfully parsed file <https://builds.apache.org/job/Apache-falcon/ws/hadoop-dependencies/target/checkstyle-result.xml>
of module  with 0 warnings.
[CHECKSTYLE] Successfully parsed file <https://builds.apache.org/job/Apache-falcon/ws/hadoop-webapp/target/checkstyle-result.xml>
of module  with 0 warnings.
[CHECKSTYLE] Successfully parsed file <https://builds.apache.org/job/Apache-falcon/ws/messaging/target/checkstyle-result.xml>
of module  with 0 warnings.
[CHECKSTYLE] Successfully parsed file <https://builds.apache.org/job/Apache-falcon/ws/metrics/target/checkstyle-result.xml>
of module  with 0 warnings.
[CHECKSTYLE] Successfully parsed file <https://builds.apache.org/job/Apache-falcon/ws/oozie-el-extensions/target/checkstyle-result.xml>
of module  with 0 warnings.
[CHECKSTYLE] Successfully parsed file <https://builds.apache.org/job/Apache-falcon/ws/oozie/target/checkstyle-result.xml>
of module  with 0 warnings.
[CHECKSTYLE] Successfully parsed file <https://builds.apache.org/job/Apache-falcon/ws/prism/target/checkstyle-result.xml>
of module  with 0 warnings.
[CHECKSTYLE] Successfully parsed file <https://builds.apache.org/job/Apache-falcon/ws/replication/target/checkstyle-result.xml>
of module  with 0 warnings.
[CHECKSTYLE] Successfully parsed file <https://builds.apache.org/job/Apache-falcon/ws/rerun/target/checkstyle-result.xml>
of module  with 0 warnings.
[CHECKSTYLE] Successfully parsed file <https://builds.apache.org/job/Apache-falcon/ws/retention/target/checkstyle-result.xml>
of module  with 0 warnings.
[CHECKSTYLE] Successfully parsed file <https://builds.apache.org/job/Apache-falcon/ws/target/checkstyle-result.xml>
of module  with 0 warnings.
[CHECKSTYLE] Successfully parsed file <https://builds.apache.org/job/Apache-falcon/ws/target/oozie-4.0.1/client/target/checkstyle-result.xml>
of module  with 81 warnings.
[CHECKSTYLE] Successfully parsed file <https://builds.apache.org/job/Apache-falcon/ws/target/oozie-4.0.1/core/target/checkstyle-result.xml>
of module  with 1940 warnings.
[CHECKSTYLE] Successfully parsed file <https://builds.apache.org/job/Apache-falcon/ws/target/oozie-4.0.1/distro/target/checkstyle-result.xml>
of module  with 0 warnings.
[CHECKSTYLE] Successfully parsed file <https://builds.apache.org/job/Apache-falcon/ws/target/oozie-4.0.1/docs/target/checkstyle-result.xml>
of module  with 3 warnings.
[CHECKSTYLE] Successfully parsed file <https://builds.apache.org/job/Apache-falcon/ws/target/oozie-4.0.1/examples/target/checkstyle-result.xml>
of module  with 34 warnings.
[CHECKSTYLE] Successfully parsed file <https://builds.apache.org/job/Apache-falcon/ws/target/oozie-4.0.1/hadooplibs/hadoop-0.23/target/checkstyle-result.xml>
of module  with 0 warnings.
[CHECKSTYLE] Successfully parsed file <https://builds.apache.org/job/Apache-falcon/ws/target/oozie-4.0.1/hadooplibs/hadoop-1/target/checkstyle-result.xml>
of module  with 0 warnings.
[CHECKSTYLE] Successfully parsed file <https://builds.apache.org/job/Apache-falcon/ws/target/oozie-4.0.1/hadooplibs/hadoop-2/target/checkstyle-result.xml>
of module  with 0 warnings.
[CHECKSTYLE] Successfully parsed file <https://builds.apache.org/job/Apache-falcon/ws/target/oozie-4.0.1/hadooplibs/hadoop-distcp-0.23/target/checkstyle-result.xml>
of module  with 0 warnings.
[CHECKSTYLE] Successfully parsed file <https://builds.apache.org/job/Apache-falcon/ws/target/oozie-4.0.1/hadooplibs/hadoop-distcp-1/target/checkstyle-result.xml>
of module  with 0 warnings.
[CHECKSTYLE] Successfully parsed file <https://builds.apache.org/job/Apache-falcon/ws/target/oozie-4.0.1/hadooplibs/hadoop-distcp-2/target/checkstyle-result.xml>
of module  with 0 warnings.
[CHECKSTYLE] Successfully parsed file <https://builds.apache.org/job/Apache-falcon/ws/target/oozie-4.0.1/hadooplibs/hadoop-test-0.23/target/checkstyle-result.xml>
of module  with 0 warnings.
[CHECKSTYLE] Successfully parsed file <https://builds.apache.org/job/Apache-falcon/ws/target/oozie-4.0.1/hadooplibs/hadoop-test-1/target/checkstyle-result.xml>
of module  with 0 warnings.
[CHECKSTYLE] Successfully parsed file <https://builds.apache.org/job/Apache-falcon/ws/target/oozie-4.0.1/hadooplibs/hadoop-test-2/target/checkstyle-result.xml>
of module  with 0 warnings.
[CHECKSTYLE] Successfully parsed file <https://builds.apache.org/job/Apache-falcon/ws/target/oozie-4.0.1/hadooplibs/target/checkstyle-result.xml>
of module  with 0 warnings.
[CHECKSTYLE] Successfully parsed file <https://builds.apache.org/job/Apache-falcon/ws/target/oozie-4.0.1/hbaselibs/hbase-0.94/target/checkstyle-result.xml>
of module  with 0 warnings.
[CHECKSTYLE] Successfully parsed file <https://builds.apache.org/job/Apache-falcon/ws/target/oozie-4.0.1/hbaselibs/target/checkstyle-result.xml>
of module  with 0 warnings.
[CHECKSTYLE] Successfully parsed file <https://builds.apache.org/job/Apache-falcon/ws/target/oozie-4.0.1/hcataloglibs/hcatalog-0.5/target/checkstyle-result.xml>
of module  with 0 warnings.
[CHECKSTYLE] Successfully parsed file <https://builds.apache.org/job/Apache-falcon/ws/target/oozie-4.0.1/hcataloglibs/hcatalog-0.6/target/checkstyle-result.xml>
of module  with 0 warnings.
[CHECKSTYLE] Successfully parsed file <https://builds.apache.org/job/Apache-falcon/ws/target/oozie-4.0.1/hcataloglibs/target/checkstyle-result.xml>
of module  with 0 warnings.
[CHECKSTYLE] Successfully parsed file <https://builds.apache.org/job/Apache-falcon/ws/target/oozie-4.0.1/minitest/target/checkstyle-result.xml>
of module  with 0 warnings.
[CHECKSTYLE] Successfully parsed file <https://builds.apache.org/job/Apache-falcon/ws/target/oozie-4.0.1/sharelib/distcp/target/checkstyle-result.xml>
of module  with 0 warnings.
[CHECKSTYLE] Successfully parsed file <https://builds.apache.org/job/Apache-falcon/ws/target/oozie-4.0.1/sharelib/hcatalog/target/checkstyle-result.xml>
of module  with 3 warnings.
[CHECKSTYLE] Successfully parsed file <https://builds.apache.org/job/Apache-falcon/ws/target/oozie-4.0.1/sharelib/hive/target/checkstyle-result.xml>
of module  with 3 warnings.
[CHECKSTYLE] Successfully parsed file <https://builds.apache.org/job/Apache-falcon/ws/target/oozie-4.0.1/sharelib/oozie/target/checkstyle-result.xml>
of module  with 22 warnings.
[CHECKSTYLE] Successfully parsed file <https://builds.apache.org/job/Apache-falcon/ws/target/oozie-4.0.1/sharelib/pig/target/checkstyle-result.xml>
of module  with 8 warnings.
[CHECKSTYLE] Successfully parsed file <https://builds.apache.org/job/Apache-falcon/ws/target/oozie-4.0.1/sharelib/sqoop/target/checkstyle-result.xml>
of module  with 2 warnings.
[CHECKSTYLE] Successfully parsed file <https://builds.apache.org/job/Apache-falcon/ws/target/oozie-4.0.1/sharelib/streaming/target/checkstyle-result.xml>
of module  with 4 warnings.
[CHECKSTYLE] Successfully parsed file <https://builds.apache.org/job/Apache-falcon/ws/target/oozie-4.0.1/sharelib/target/checkstyle-result.xml>
of module  with 0 warnings.
[CHECKSTYLE] Successfully parsed file <https://builds.apache.org/job/Apache-falcon/ws/target/oozie-4.0.1/target/checkstyle-result.xml>
of module  with 0 warnings.
[CHECKSTYLE] Successfully parsed file <https://builds.apache.org/job/Apache-falcon/ws/target/oozie-4.0.1/tools/target/checkstyle-result.xml>
of module  with 9 warnings.
[CHECKSTYLE] Successfully parsed file <https://builds.apache.org/job/Apache-falcon/ws/target/oozie-4.0.1/webapp/target/checkstyle-result.xml>
of module  with 0 warnings.
[CHECKSTYLE] Successfully parsed file <https://builds.apache.org/job/Apache-falcon/ws/test-util/target/checkstyle-result.xml>
of module  with 0 warnings.
[CHECKSTYLE] Computing warning deltas based on reference build #334
[FINDBUGS] Collecting findbugs analysis files...
[FINDBUGS] Finding all files that match the pattern **/target/findbugs.xml
[FINDBUGS] Parsing 13 files in <https://builds.apache.org/job/Apache-falcon/ws/>
[FINDBUGS] Successfully parsed file <https://builds.apache.org/job/Apache-falcon/ws/client/target/findbugs.xml>
of module  with 0 warnings.
[FINDBUGS] Successfully parsed file <https://builds.apache.org/job/Apache-falcon/ws/common/target/findbugs.xml>
of module  with 0 warnings.
[FINDBUGS] Successfully parsed file <https://builds.apache.org/job/Apache-falcon/ws/hadoop-dependencies/target/findbugs.xml>
of module  with 0 warnings.
[FINDBUGS] Successfully parsed file <https://builds.apache.org/job/Apache-falcon/ws/hadoop-webapp/target/findbugs.xml>
of module  with 0 warnings.
[FINDBUGS] Successfully parsed file <https://builds.apache.org/job/Apache-falcon/ws/messaging/target/findbugs.xml>
of module  with 0 warnings.
[FINDBUGS] Successfully parsed file <https://builds.apache.org/job/Apache-falcon/ws/metrics/target/findbugs.xml>
of module  with 0 warnings.
[FINDBUGS] Successfully parsed file <https://builds.apache.org/job/Apache-falcon/ws/oozie-el-extensions/target/findbugs.xml>
of module  with 0 warnings.
[FINDBUGS] Successfully parsed file <https://builds.apache.org/job/Apache-falcon/ws/oozie/target/findbugs.xml>
of module  with 0 warnings.
[FINDBUGS] Successfully parsed file <https://builds.apache.org/job/Apache-falcon/ws/prism/target/findbugs.xml>
of module  with 0 warnings.
[FINDBUGS] Successfully parsed file <https://builds.apache.org/job/Apache-falcon/ws/replication/target/findbugs.xml>
of module  with 0 warnings.
[FINDBUGS] Successfully parsed file <https://builds.apache.org/job/Apache-falcon/ws/rerun/target/findbugs.xml>
of module  with 0 warnings.
[FINDBUGS] Successfully parsed file <https://builds.apache.org/job/Apache-falcon/ws/retention/target/findbugs.xml>
of module  with 0 warnings.
[FINDBUGS] Successfully parsed file <https://builds.apache.org/job/Apache-falcon/ws/test-util/target/findbugs.xml>
of module  with 0 warnings.
[FINDBUGS] Computing warning deltas based on reference build #334
Archiving artifacts
Sending artifact delta relative to Apache-falcon #334
Archived 14 artifacts
Archive block size is 32768
Received 0 blocks and 2014406 bytes
Compression is 0.0%
Took 4.9 sec
Recording test results
TestNG Reports Processing: START
Looking for TestNG results report in workspace using pattern: **/target/testng-results.xml
Did not find any matching files.

Mime
View raw message