falcon-dev mailing list archives

Site index · List index
Message view « Date » · « Thread »
Top « Date » · « Thread »
From Apache Jenkins Server <jenk...@builds.apache.org>
Subject Build failed in Jenkins: Apache-falcon #358
Date Thu, 31 Jul 2014 00:44:40 GMT
See <https://builds.apache.org/job/Apache-falcon/358/>

------------------------------------------
[...truncated 798 lines...]
            
Downloading: https://repository.apache.org/content/groups/public/asm/asm/maven-metadata.xml
            
Downloading: https://maven.java.net/content/groups/public/asm/asm/maven-metadata.xml
            
            
Downloading: https://repository.jboss.org/nexus/content/groups/public/asm/asm/maven-metadata.xml
Downloading: https://repository.cloudera.com/artifactory/cloudera-repos/asm/asm/maven-metadata.xml
925/925 B   
            
Downloading: http://repository.apache.org/snapshots/asm/asm/maven-metadata.xml
            
Downloaded: https://repository.jboss.org/nexus/content/groups/public/asm/asm/maven-metadata.xml
(925 B at 1.8 KB/sec)
Downloading: http://www.datanucleus.org/downloads/maven2/asm/asm/maven-metadata.xml
            
Downloading: http://www.datanucleus.org/downloads/maven2/asm/asm/maven-metadata.xml
            
            
            
            
[WARNING] Could not transfer metadata asm:asm/maven-metadata.xml from/to local.repository
(file:../../local.repository/trunk): No connector available to access repository local.repository
(file:../../local.repository/trunk) of type legacy using the available factories WagonRepositoryConnectorFactory
[INFO] 
[INFO] --- maven-clean-plugin:2.5:clean (default-clean) @ falcon-common ---
[INFO] Deleting <https://builds.apache.org/job/Apache-falcon/ws/common/target>
[INFO] 
[INFO] --- maven-enforcer-plugin:1.3.1:enforce (enforce-property) @ falcon-common ---
[INFO] 
[INFO] --- buildnumber-maven-plugin:1.0:create (default) @ falcon-common ---
[INFO] Checking for local modifications: skipped.
[INFO] Updating project files from SCM: skipped.
[INFO] Executing: /bin/sh -c cd <https://builds.apache.org/job/Apache-falcon/ws/common>
&& git show
[INFO] Working directory: <https://builds.apache.org/job/Apache-falcon/ws/common>
[INFO] Storing buildNumber: ed100c8ac0b2cc086556fabbf14b2ea3e8424101 at timestamp: 1406767241380
[INFO] Executing: /bin/sh -c cd <https://builds.apache.org/job/Apache-falcon/ws/common>
&& git show
[INFO] Working directory: <https://builds.apache.org/job/Apache-falcon/ws/common>
[INFO] Storing buildScmBranch: UNKNOWN
[INFO] 
[INFO] --- maven-remote-resources-plugin:1.4:process (default) @ falcon-common ---
[INFO] artifact asm:asm: checking for updates from central
[INFO] artifact asm:asm: checking for updates from im
[INFO] artifact asm:asm: checking for updates from hortonworks.repo
[INFO] artifact asm:asm: checking for updates from Codehaus repository
[INFO] artifact asm:asm: checking for updates from apache.snapshots.repo
[INFO] artifact asm:asm: checking for updates from default
[INFO] artifact asm:asm: checking for updates from java.net-Public
[INFO] artifact asm:asm: checking for updates from repository.jboss.org-public
[INFO] artifact asm:asm: checking for updates from cdh.repo
[INFO] artifact asm:asm: checking for updates from datanucleus
[INFO] artifact asm:asm: checking for updates from local.repository
[INFO] artifact asm:asm: checking for updates from DN_M2_Repo
[INFO] 
[INFO] --- maven-resources-plugin:2.6:resources (default-resources) @ falcon-common ---
[INFO] Using 'UTF-8' encoding to copy filtered resources.
[INFO] Copying 0 resource
[INFO] Copying 3 resources
[INFO] Copying 0 resource
[INFO] Copying 2 resources to META-INF
[INFO] Copying 3 resources
[INFO] 
[INFO] --- maven-compiler-plugin:2.3.2:compile (default-compile) @ falcon-common ---
[INFO] Compiling 68 source files to <https://builds.apache.org/job/Apache-falcon/ws/common/target/classes>
[INFO] 
[INFO] --- maven-resources-plugin:2.6:testResources (default-testResources) @ falcon-common
---
[INFO] Using 'UTF-8' encoding to copy filtered resources.
[INFO] Copying 17 resources
[INFO] Copying 3 resources
[INFO] 
[INFO] --- maven-compiler-plugin:2.3.2:testCompile (default-testCompile) @ falcon-common ---
[INFO] Compiling 26 source files to <https://builds.apache.org/job/Apache-falcon/ws/common/target/test-classes>
[INFO] 
[INFO] --- maven-surefire-plugin:2.16:test (default-test) @ falcon-common ---
[WARNING] The parameter forkMode is deprecated since version 2.14. Use forkCount and reuseForks
instead.
[INFO] Surefire report directory: <https://builds.apache.org/job/Apache-falcon/ws/common/target/surefire-reports>

-------------------------------------------------------
 T E S T S
-------------------------------------------------------

-------------------------------------------------------
 T E S T S
-------------------------------------------------------
Running org.apache.falcon.metadata.MetadataMappingServiceTest
Tests run: 13, Failures: 1, Errors: 0, Skipped: 12, Time elapsed: 1.976 sec <<< FAILURE!
- in org.apache.falcon.metadata.MetadataMappingServiceTest
setUp(org.apache.falcon.metadata.MetadataMappingServiceTest)  Time elapsed: 1.739 sec  <<<
FAILURE!
java.lang.RuntimeException: GraphFactory could not instantiate this Graph implementation [com.thinkaurelius.titan.core.TitanFactory].
	at java.net.InetAddress.getLocalHost(InetAddress.java:1402)
	at com.thinkaurelius.titan.diskstorage.common.DistributedStoreManager.getRid(DistributedStoreManager.java:171)
	at com.thinkaurelius.titan.diskstorage.idmanagement.AbstractIDManager.<init>(AbstractIDManager.java:39)
	at com.thinkaurelius.titan.diskstorage.idmanagement.TransactionalIDManager.<init>(TransactionalIDManager.java:37)
	at com.thinkaurelius.titan.diskstorage.Backend.initialize(Backend.java:249)
	at com.thinkaurelius.titan.graphdb.configuration.GraphDatabaseConfiguration.getBackend(GraphDatabaseConfiguration.java:1164)
	at com.thinkaurelius.titan.graphdb.database.StandardTitanGraph.<init>(StandardTitanGraph.java:75)
	at com.thinkaurelius.titan.core.TitanFactory.open(TitanFactory.java:40)
	at sun.reflect.NativeMethodAccessorImpl.invoke0(Native Method)
	at sun.reflect.NativeMethodAccessorImpl.invoke(NativeMethodAccessorImpl.java:39)
	at sun.reflect.DelegatingMethodAccessorImpl.invoke(DelegatingMethodAccessorImpl.java:25)
	at java.lang.reflect.Method.invoke(Method.java:597)
	at com.tinkerpop.blueprints.GraphFactory.open(GraphFactory.java:43)
	at org.apache.falcon.metadata.MetadataMappingService.initializeGraphDB(MetadataMappingService.java:101)
	at org.apache.falcon.metadata.MetadataMappingService.init(MetadataMappingService.java:78)
	at org.apache.falcon.metadata.MetadataMappingServiceTest.setUp(MetadataMappingServiceTest.java:104)

Running org.apache.falcon.metadata.LineageRecorderTest
Tests run: 2, Failures: 0, Errors: 0, Skipped: 0, Time elapsed: 0.873 sec - in org.apache.falcon.metadata.LineageRecorderTest
Running org.apache.falcon.entity.FileSystemStorageTest
Tests run: 35, Failures: 0, Errors: 0, Skipped: 0, Time elapsed: 1.071 sec - in org.apache.falcon.entity.FileSystemStorageTest
Running org.apache.falcon.entity.v0.EntityGraphTest
Tests run: 4, Failures: 0, Errors: 0, Skipped: 0, Time elapsed: 1.266 sec - in org.apache.falcon.entity.v0.EntityGraphTest
Running org.apache.falcon.entity.parser.ClusterEntityParserTest
Tests run: 4, Failures: 0, Errors: 0, Skipped: 0, Time elapsed: 1.345 sec - in org.apache.falcon.entity.parser.ClusterEntityParserTest
Running org.apache.falcon.entity.parser.FeedUpdateTest
Tests run: 4, Failures: 0, Errors: 0, Skipped: 0, Time elapsed: 1.818 sec - in org.apache.falcon.entity.parser.FeedUpdateTest
Running org.apache.falcon.entity.parser.ProcessEntityParserTest
Tests run: 19, Failures: 0, Errors: 0, Skipped: 0, Time elapsed: 3.155 sec - in org.apache.falcon.entity.parser.ProcessEntityParserTest
Running org.apache.falcon.entity.parser.FeedEntityParserTest
Tests run: 22, Failures: 0, Errors: 0, Skipped: 0, Time elapsed: 2.769 sec - in org.apache.falcon.entity.parser.FeedEntityParserTest
Running org.apache.falcon.entity.EntityUtilTest
Tests run: 15, Failures: 0, Errors: 0, Skipped: 0, Time elapsed: 1.497 sec - in org.apache.falcon.entity.EntityUtilTest
Running org.apache.falcon.entity.EntityTypeTest
Tests run: 2, Failures: 0, Errors: 0, Skipped: 0, Time elapsed: 0.864 sec - in org.apache.falcon.entity.EntityTypeTest
Running org.apache.falcon.entity.ColoClusterRelationTest
Tests run: 1, Failures: 0, Errors: 0, Skipped: 0, Time elapsed: 1.234 sec - in org.apache.falcon.entity.ColoClusterRelationTest
Running org.apache.falcon.entity.store.ConfigurationStoreTest
Tests run: 15, Failures: 0, Errors: 0, Skipped: 0, Time elapsed: 1.359 sec - in org.apache.falcon.entity.store.ConfigurationStoreTest
Running org.apache.falcon.entity.StorageFactoryTest
Tests run: 36, Failures: 0, Errors: 0, Skipped: 0, Time elapsed: 1.56 sec - in org.apache.falcon.entity.StorageFactoryTest
Running org.apache.falcon.entity.CatalogStorageTest
Tests run: 17, Failures: 0, Errors: 0, Skipped: 0, Time elapsed: 0.514 sec - in org.apache.falcon.entity.CatalogStorageTest
Running org.apache.falcon.entity.TestWorkflowNameBuilder
Tests run: 3, Failures: 0, Errors: 0, Skipped: 0, Time elapsed: 0.856 sec - in org.apache.falcon.entity.TestWorkflowNameBuilder
Running org.apache.falcon.entity.FeedHelperTest
Tests run: 2, Failures: 0, Errors: 0, Skipped: 0, Time elapsed: 0.423 sec - in org.apache.falcon.entity.FeedHelperTest
Running org.apache.falcon.group.FeedGroupMapTest
Tests run: 3, Failures: 0, Errors: 0, Skipped: 0, Time elapsed: 1.352 sec - in org.apache.falcon.group.FeedGroupMapTest
Running org.apache.falcon.security.AuthenticationInitializationServiceTest
Tests run: 5, Failures: 0, Errors: 0, Skipped: 0, Time elapsed: 0.853 sec - in org.apache.falcon.security.AuthenticationInitializationServiceTest
Running org.apache.falcon.security.CurrentUserTest
Tests run: 10, Failures: 0, Errors: 0, Skipped: 0, Time elapsed: 0.532 sec - in org.apache.falcon.security.CurrentUserTest
Running org.apache.falcon.security.SecurityUtilTest
Tests run: 5, Failures: 0, Errors: 0, Skipped: 0, Time elapsed: 0.691 sec - in org.apache.falcon.security.SecurityUtilTest
Running org.apache.falcon.util.ReflectionUtilsTest
Tests run: 1, Failures: 0, Errors: 0, Skipped: 0, Time elapsed: 0.951 sec - in org.apache.falcon.util.ReflectionUtilsTest
Running org.apache.falcon.util.ApplicationPropertiesTest
Tests run: 3, Failures: 0, Errors: 0, Skipped: 0, Time elapsed: 0.518 sec - in org.apache.falcon.util.ApplicationPropertiesTest
Running org.apache.falcon.hadoop.HadoopClientFactoryTest
Tests run: 3, Failures: 0, Errors: 0, Skipped: 0, Time elapsed: 0.759 sec - in org.apache.falcon.hadoop.HadoopClientFactoryTest
Running org.apache.falcon.update.UpdateHelperTest
Tests run: 5, Failures: 0, Errors: 0, Skipped: 0, Time elapsed: 2.901 sec - in org.apache.falcon.update.UpdateHelperTest
Running org.apache.falcon.cleanup.LogCleanupServiceTest
Tests run: 1, Failures: 0, Errors: 0, Skipped: 0, Time elapsed: 2.794 sec - in org.apache.falcon.cleanup.LogCleanupServiceTest

Results :

Failed tests: 
  MetadataMappingServiceTest.setUp:104 ? Runtime GraphFactory could not instanti...

Tests run: 230, Failures: 1, Errors: 0, Skipped: 12

[INFO] ------------------------------------------------------------------------
[INFO] Reactor Summary:
[INFO] 
[INFO] Checkstyle ........................................ SUCCESS [  1.040 s]
[INFO] Apache Falcon ..................................... SUCCESS [  6.589 s]
[INFO] Build Tools ....................................... SUCCESS [  4.396 s]
[INFO] Apache Falcon CLI client .......................... SUCCESS [ 26.706 s]
[INFO] Apache Falcon Metrics ............................. SUCCESS [ 10.452 s]
[INFO] Apache Falcon Hadoop Dependencies ................. SUCCESS [ 12.018 s]
[INFO] Apache Falcon Test Utility ........................ SUCCESS [  9.164 s]
[INFO] Apache Falcon Commons ............................. FAILURE [ 51.214 s]
[INFO] Apache Falcon Oozie EL Extension .................. SKIPPED
[INFO] Apache Falcon Embedded Hadoop - Test Cluster ...... SKIPPED
[INFO] Apache Falcon Messaging ........................... SKIPPED
[INFO] Apache Falcon Oozie Adaptor ....................... SKIPPED
[INFO] Apache Falcon Acquisition ......................... SKIPPED
[INFO] Apache Falcon Replication ......................... SKIPPED
[INFO] Apache Falcon Retention ........................... SKIPPED
[INFO] Apache Falcon Archival ............................ SKIPPED
[INFO] Apache Falcon Rerun ............................... SKIPPED
[INFO] Apache Falcon Prism ............................... SKIPPED
[INFO] Apache Falcon Web Application ..................... SKIPPED
[INFO] Apache Falcon Documentation ....................... SKIPPED
[INFO] ------------------------------------------------------------------------
[INFO] BUILD FAILURE
[INFO] ------------------------------------------------------------------------
[INFO] Total time: 02:02 min
[INFO] Finished at: 2014-07-31T00:41:28+00:00
[INFO] Final Memory: 82M/758M
[INFO] ------------------------------------------------------------------------
[ERROR] Failed to execute goal org.apache.maven.plugins:maven-surefire-plugin:2.16:test (default-test)
on project falcon-common: There are test failures.
[ERROR] 
[ERROR] Please refer to <https://builds.apache.org/job/Apache-falcon/ws/common/target/surefire-reports>
for the individual test results.
[ERROR] -> [Help 1]
[ERROR] 
[ERROR] To see the full stack trace of the errors, re-run Maven with the -e switch.
[ERROR] Re-run Maven using the -X switch to enable full debug logging.
[ERROR] 
[ERROR] For more information about the errors and possible solutions, please read the following
articles:
[ERROR] [Help 1] http://cwiki.apache.org/confluence/display/MAVEN/MojoFailureException
[ERROR] 
[ERROR] After correcting the problems, you can resume the build with the command
[ERROR]   mvn <goals> -rf :falcon-common
Build step 'Execute shell' marked build as failure
[CHECKSTYLE] Collecting checkstyle analysis files...
[CHECKSTYLE] Finding all files that match the pattern **/target/checkstyle-result.xml
[CHECKSTYLE] Parsing 16 files in <https://builds.apache.org/job/Apache-falcon/ws/>
[CHECKSTYLE] Successfully parsed file <https://builds.apache.org/job/Apache-falcon/ws/acquisition/target/checkstyle-result.xml>
of module  with 0 warnings.
[CHECKSTYLE] Successfully parsed file <https://builds.apache.org/job/Apache-falcon/ws/archival/target/checkstyle-result.xml>
of module  with 0 warnings.
[CHECKSTYLE] Successfully parsed file <https://builds.apache.org/job/Apache-falcon/ws/build-tools/target/checkstyle-result.xml>
of module  with 0 warnings.
[CHECKSTYLE] Successfully parsed file <https://builds.apache.org/job/Apache-falcon/ws/client/target/checkstyle-result.xml>
of module  with 0 warnings.
[CHECKSTYLE] Successfully parsed file <https://builds.apache.org/job/Apache-falcon/ws/hadoop-dependencies/target/checkstyle-result.xml>
of module  with 0 warnings.
[CHECKSTYLE] Successfully parsed file <https://builds.apache.org/job/Apache-falcon/ws/hadoop-webapp/target/checkstyle-result.xml>
of module  with 0 warnings.
[CHECKSTYLE] Successfully parsed file <https://builds.apache.org/job/Apache-falcon/ws/messaging/target/checkstyle-result.xml>
of module  with 0 warnings.
[CHECKSTYLE] Successfully parsed file <https://builds.apache.org/job/Apache-falcon/ws/metrics/target/checkstyle-result.xml>
of module  with 0 warnings.
[CHECKSTYLE] Successfully parsed file <https://builds.apache.org/job/Apache-falcon/ws/oozie-el-extensions/target/checkstyle-result.xml>
of module  with 0 warnings.
[CHECKSTYLE] Successfully parsed file <https://builds.apache.org/job/Apache-falcon/ws/oozie/target/checkstyle-result.xml>
of module  with 0 warnings.
[CHECKSTYLE] Successfully parsed file <https://builds.apache.org/job/Apache-falcon/ws/prism/target/checkstyle-result.xml>
of module  with 0 warnings.
[CHECKSTYLE] Successfully parsed file <https://builds.apache.org/job/Apache-falcon/ws/replication/target/checkstyle-result.xml>
of module  with 0 warnings.
[CHECKSTYLE] Successfully parsed file <https://builds.apache.org/job/Apache-falcon/ws/rerun/target/checkstyle-result.xml>
of module  with 0 warnings.
[CHECKSTYLE] Successfully parsed file <https://builds.apache.org/job/Apache-falcon/ws/retention/target/checkstyle-result.xml>
of module  with 0 warnings.
[CHECKSTYLE] Successfully parsed file <https://builds.apache.org/job/Apache-falcon/ws/target/checkstyle-result.xml>
of module  with 0 warnings.
[CHECKSTYLE] Successfully parsed file <https://builds.apache.org/job/Apache-falcon/ws/test-util/target/checkstyle-result.xml>
of module  with 0 warnings.
[CHECKSTYLE] Computing warning deltas based on reference build #334
[FINDBUGS] Collecting findbugs analysis files...
[FINDBUGS] Finding all files that match the pattern **/target/findbugs.xml
[FINDBUGS] Parsing 12 files in <https://builds.apache.org/job/Apache-falcon/ws/>
[FINDBUGS] Successfully parsed file <https://builds.apache.org/job/Apache-falcon/ws/client/target/findbugs.xml>
of module  with 0 warnings.
[FINDBUGS] Successfully parsed file <https://builds.apache.org/job/Apache-falcon/ws/hadoop-dependencies/target/findbugs.xml>
of module  with 0 warnings.
[FINDBUGS] Successfully parsed file <https://builds.apache.org/job/Apache-falcon/ws/hadoop-webapp/target/findbugs.xml>
of module  with 0 warnings.
[FINDBUGS] Successfully parsed file <https://builds.apache.org/job/Apache-falcon/ws/messaging/target/findbugs.xml>
of module  with 0 warnings.
[FINDBUGS] Successfully parsed file <https://builds.apache.org/job/Apache-falcon/ws/metrics/target/findbugs.xml>
of module  with 0 warnings.
[FINDBUGS] Successfully parsed file <https://builds.apache.org/job/Apache-falcon/ws/oozie-el-extensions/target/findbugs.xml>
of module  with 0 warnings.
[FINDBUGS] Successfully parsed file <https://builds.apache.org/job/Apache-falcon/ws/oozie/target/findbugs.xml>
of module  with 0 warnings.
[FINDBUGS] Successfully parsed file <https://builds.apache.org/job/Apache-falcon/ws/prism/target/findbugs.xml>
of module  with 0 warnings.
[FINDBUGS] Successfully parsed file <https://builds.apache.org/job/Apache-falcon/ws/replication/target/findbugs.xml>
of module  with 0 warnings.
[FINDBUGS] Successfully parsed file <https://builds.apache.org/job/Apache-falcon/ws/rerun/target/findbugs.xml>
of module  with 0 warnings.
[FINDBUGS] Successfully parsed file <https://builds.apache.org/job/Apache-falcon/ws/retention/target/findbugs.xml>
of module  with 0 warnings.
[FINDBUGS] Successfully parsed file <https://builds.apache.org/job/Apache-falcon/ws/test-util/target/findbugs.xml>
of module  with 0 warnings.
[FINDBUGS] Computing warning deltas based on reference build #334
Archiving artifacts
Sending artifact delta relative to Apache-falcon #334
Archived 13 artifacts
Archive block size is 32768
Received 0 blocks and 339689 bytes
Compression is 0.0%
Took 2.5 sec
Recording test results
TestNG Reports Processing: START
Looking for TestNG results report in workspace using pattern: **/target/testng-results.xml
Did not find any matching files.

Mime
View raw message