falcon-dev mailing list archives

Site index · List index
Message view « Date » · « Thread »
Top « Date » · « Thread »
From Apache Jenkins Server <jenk...@builds.apache.org>
Subject Build failed in Jenkins: Apache-falcon #336
Date Wed, 09 Jul 2014 14:16:27 GMT
See <https://builds.apache.org/job/Apache-falcon/336/changes>

Changes:

[shwetha.gs] FALCON-497 Able to submit feed even though owner of storage specified (location
type=data) is different from the ACL owner. Contributed by Shwetha GS

------------------------------------------
[...truncated 2626 lines...]
151/578 KB   202/227 KB   
155/578 KB   202/227 KB   
155/578 KB   202/227 KB   
158/578 KB   202/227 KB   
162/578 KB   202/227 KB   
166/578 KB   202/227 KB   
170/578 KB   202/227 KB   
174/578 KB   202/227 KB   
178/578 KB   202/227 KB   
182/578 KB   202/227 KB   
186/578 KB   202/227 KB   
190/578 KB   202/227 KB   
191/578 KB   202/227 KB   
191/578 KB   206/227 KB   
191/578 KB   210/227 KB   
191/578 KB   214/227 KB   
191/578 KB   218/227 KB   
191/578 KB   222/227 KB   
191/578 KB   226/227 KB   
191/578 KB   227/227 KB   
195/578 KB   227/227 KB   
197/578 KB   227/227 KB   
201/578 KB   227/227 KB   
205/578 KB   227/227 KB   
205/578 KB   227/227 KB   
209/578 KB   227/227 KB   
211/578 KB   227/227 KB   
215/578 KB   227/227 KB   
219/578 KB   227/227 KB   
223/578 KB   227/227 KB   
227/578 KB   227/227 KB   
231/578 KB   227/227 KB   
235/578 KB   227/227 KB   
239/578 KB   227/227 KB   
240/578 KB   227/227 KB   
244/578 KB   227/227 KB   
248/578 KB   227/227 KB   
252/578 KB   227/227 KB   
256/578 KB   227/227 KB   
260/578 KB   227/227 KB   
264/578 KB   227/227 KB   
268/578 KB   227/227 KB   
272/578 KB   227/227 KB   
276/578 KB   227/227 KB   
280/578 KB   227/227 KB   
284/578 KB   227/227 KB   
288/578 KB   227/227 KB   
292/578 KB   227/227 KB   
                          
296/578 KB                
Downloaded: http://repo1.maven.org/maven2/org/yaml/snakeyaml/1.6/snakeyaml-1.6.jar (227 KB
at 743.2 KB/sec)
297/578 KB   
301/578 KB   
305/578 KB   
308/578 KB   
310/578 KB   
314/578 KB   
318/578 KB   
322/578 KB   
326/578 KB   
330/578 KB   
334/578 KB   
338/578 KB   
342/578 KB   
346/578 KB   
350/578 KB   
354/578 KB   
358/578 KB   
362/578 KB   
365/578 KB   
369/578 KB   
373/578 KB   
377/578 KB   
380/578 KB   
384/578 KB   
388/578 KB   
392/578 KB   
396/578 KB   
400/578 KB   
404/578 KB   
408/578 KB   
412/578 KB   
416/578 KB   
420/578 KB   
424/578 KB   
428/578 KB   
432/578 KB   
436/578 KB   
440/578 KB   
443/578 KB   
447/578 KB   
451/578 KB   
451/578 KB   
454/578 KB   
458/578 KB   
461/578 KB   
465/578 KB   
469/578 KB   
473/578 KB   
477/578 KB   
481/578 KB   
485/578 KB   
489/578 KB   
493/578 KB   
497/578 KB   
501/578 KB   
505/578 KB   
509/578 KB   
513/578 KB   
517/578 KB   
521/578 KB   
525/578 KB   
529/578 KB   
530/578 KB   
534/578 KB   
538/578 KB   
542/578 KB   
546/578 KB   
550/578 KB   
554/578 KB   
554/578 KB   
556/578 KB   
560/578 KB   
564/578 KB   
568/578 KB   
572/578 KB   
576/578 KB   
578/578 KB   
             
Downloaded: http://repo1.maven.org/maven2/org/testng/testng/6.1.1/testng-6.1.1.jar (578 KB
at 1215.2 KB/sec)
[INFO] 
[INFO] --- maven-clean-plugin:2.5:clean (default-clean) @ build-tools ---
[INFO] 
[INFO] --- maven-enforcer-plugin:1.3.1:enforce (enforce-property) @ build-tools ---
[INFO] 
[INFO] --- buildnumber-maven-plugin:1.0:create (default) @ build-tools ---
[INFO] Checking for local modifications: skipped.
[INFO] Updating project files from SCM: skipped.
[INFO] Executing: /bin/sh -c cd <https://builds.apache.org/job/Apache-falcon/ws/build-tools>
&& git show
[INFO] Working directory: <https://builds.apache.org/job/Apache-falcon/ws/build-tools>
[INFO] Storing buildNumber: 57953f77b03a68317b554619c2b17f8e9c623b2e at timestamp: 1404915297136
[INFO] Executing: /bin/sh -c cd <https://builds.apache.org/job/Apache-falcon/ws/build-tools>
&& git show
[INFO] Working directory: <https://builds.apache.org/job/Apache-falcon/ws/build-tools>
[INFO] Storing buildScmBranch: UNKNOWN
[INFO] 
[INFO] --- exec-maven-plugin:1.2.1:exec (BUILD-OOZIE) @ build-tools ---
Downloading: http://repo.maven.apache.org/maven2/org/apache/commons/commons-exec/1.1/commons-exec-1.1.pom
4/11 KB      
8/11 KB   
11/11 KB   
           
Downloaded: http://repo.maven.apache.org/maven2/org/apache/commons/commons-exec/1.1/commons-exec-1.1.pom
(11 KB at 199.1 KB/sec)
Downloading: http://repo.maven.apache.org/maven2/org/apache/commons/commons-exec/1.1/commons-exec-1.1.jar
4/52 KB    
8/52 KB   
12/52 KB   
16/52 KB   
20/52 KB   
24/52 KB   
28/52 KB   
32/52 KB   
36/52 KB   
40/52 KB   
44/52 KB   
48/52 KB   
52/52 KB   
           
Downloaded: http://repo.maven.apache.org/maven2/org/apache/commons/commons-exec/1.1/commons-exec-1.1.jar
(52 KB at 916.3 KB/sec)
+ VERSION=4.0.1
+ BUILD_VERSION=4.0.1-falcon
+ FORCE_BUILD=false
+ echo 'oozie version '
oozie version 
+ '[' -z /home/jenkins/tools/maven/latest ']'
+ export MVN_CMD=/home/jenkins/tools/maven/latest/bin/mvn
+ MVN_CMD=/home/jenkins/tools/maven/latest/bin/mvn
+ echo 'Using maven from ' /home/jenkins/tools/maven/latest/bin/mvn
Using maven from  /home/jenkins/tools/maven/latest/bin/mvn
+ [[ false == \f\a\l\s\e ]]
++ /home/jenkins/tools/maven/latest/bin/mvn help:effective-settings
++ grep localRepository
++ cut '-d>' -f2
++ cut '-d<' -f1
+ [[ -f /home/jenkins/.m2/repository/org/apache/oozie/oozie-webapp/4.0.1-falcon/oozie-webapp-4.0.1-falcon.war
]]
+ PKG_URL=http://archive.apache.org/dist/oozie/4.0.1/oozie-4.0.1.tar.gz
+ '[' 4.0.1 == 3.1.3-incubating ']'
+ PKG=oozie-4.0.1
+ mkdir -p ../target
+ pushd ../target
~/jenkins-slave/workspace/Apache-falcon/target ~/jenkins-slave/workspace/Apache-falcon/build-tools
+ rm -rf 'oozie-*'
+ curl -v http://archive.apache.org/dist/oozie/4.0.1/oozie-4.0.1.tar.gz -o oozie-4.0.1.tgz
src/bin/build-oozie.sh: line 54: curl: command not found
[INFO] ------------------------------------------------------------------------
[INFO] Reactor Summary:
[INFO] 
[INFO] Checkstyle ........................................ SUCCESS [  0.974 s]
[INFO] Apache Falcon ..................................... SUCCESS [  8.420 s]
[INFO] Build Tools ....................................... FAILURE [ 10.352 s]
[INFO] Apache Falcon CLI client .......................... SKIPPED
[INFO] Apache Falcon Metrics ............................. SKIPPED
[INFO] Apache Falcon Hadoop Dependencies ................. SKIPPED
[INFO] Apache Falcon Test Utility ........................ SKIPPED
[INFO] Apache Falcon Commons ............................. SKIPPED
[INFO] Apache Falcon Oozie EL Extension .................. SKIPPED
[INFO] Apache Falcon Embedded Hadoop - Test Cluster ...... SKIPPED
[INFO] Apache Falcon Messaging ........................... SKIPPED
[INFO] Apache Falcon Oozie Adaptor ....................... SKIPPED
[INFO] Apache Falcon Feed ................................ SKIPPED
[INFO] Apache Falcon Process ............................. SKIPPED
[INFO] Apache Falcon Acquisition ......................... SKIPPED
[INFO] Apache Falcon Replication ......................... SKIPPED
[INFO] Apache Falcon Retention ........................... SKIPPED
[INFO] Apache Falcon Archival ............................ SKIPPED
[INFO] Apache Falcon Rerun ............................... SKIPPED
[INFO] Apache Falcon Prism ............................... SKIPPED
[INFO] Apache Falcon Web Application ..................... SKIPPED
[INFO] Apache Falcon Documentation ....................... SKIPPED
[INFO] ------------------------------------------------------------------------
[INFO] BUILD FAILURE
[INFO] ------------------------------------------------------------------------
[INFO] Total time: 20.466 s
[INFO] Finished at: 2014-07-09T14:15:02+00:00
[INFO] Final Memory: 33M/723M
[INFO] ------------------------------------------------------------------------
[ERROR] Failed to execute goal org.codehaus.mojo:exec-maven-plugin:1.2.1:exec (BUILD-OOZIE)
on project build-tools: Command execution failed. Process exited with an error: 127 (Exit
value: 127) -> [Help 1]
[ERROR] 
[ERROR] To see the full stack trace of the errors, re-run Maven with the -e switch.
[ERROR] Re-run Maven using the -X switch to enable full debug logging.
[ERROR] 
[ERROR] For more information about the errors and possible solutions, please read the following
articles:
[ERROR] [Help 1] http://cwiki.apache.org/confluence/display/MAVEN/MojoExecutionException
[ERROR] 
[ERROR] After correcting the problems, you can resume the build with the command
[ERROR]   mvn <goals> -rf :build-tools
Build step 'Execute shell' marked build as failure
[CHECKSTYLE] Collecting checkstyle analysis files...
[CHECKSTYLE] Finding all files that match the pattern **/target/checkstyle-result.xml
[CHECKSTYLE] Parsing 1 files in <https://builds.apache.org/job/Apache-falcon/ws/>
[CHECKSTYLE] Successfully parsed file <https://builds.apache.org/job/Apache-falcon/ws/target/checkstyle-result.xml>
of module  with 0 warnings.
[CHECKSTYLE] Computing warning deltas based on reference build #334
[FINDBUGS] Collecting findbugs analysis files...
[FINDBUGS] Finding all files that match the pattern **/target/findbugs.xml
[FINDBUGS] Computing warning deltas based on reference build #334
Archiving artifacts
Recording test results
TestNG Reports Processing: START
Looking for TestNG results report in workspace using pattern: **/target/testng-results.xml
Did not find any matching files.

Mime
View raw message