falcon-dev mailing list archives

Site index · List index
Message view « Date » · « Thread »
Top « Date » · « Thread »
From "Deepak Marathe (JIRA)" <j...@apache.org>
Subject [jira] [Commented] (FALCON-330) Build fails for the module 'Apache Falcon CLI client ' on ubuntu
Date Mon, 03 Mar 2014 10:09:22 GMT

    [ https://issues.apache.org/jira/browse/FALCON-330?page=com.atlassian.jira.plugin.system.issuetabpanels:comment-tabpanel&focusedCommentId=13917906#comment-13917906
] 

Deepak Marathe commented on FALCON-330:
---------------------------------------

Build succeeds on ubuntu : 

[INFO] Reactor Summary:
[INFO] 
[INFO] Checkstyle ........................................ SUCCESS [1.142s]
[INFO] Apache Falcon ..................................... SUCCESS [1.723s]
[INFO] Build Tools ....................................... SUCCESS [3.197s]
[INFO] Apache Falcon CLI client .......................... SUCCESS [5.120s]
[INFO] Apache Falcon Metrics ............................. SUCCESS [0.951s]
[INFO] Apache Falcon Hadoop Dependencies ................. SUCCESS [0.800s]
[INFO] Apache Falcon Test Utility ........................ SUCCESS [1.262s]
[INFO] Apache Falcon Commons ............................. SUCCESS [4.900s]
[INFO] Apache Falcon Oozie EL Extension .................. SUCCESS [2.165s]
[INFO] Apache Falcon Embedded Hadoop - Test Cluster ...... SUCCESS [17.247s]
[INFO] Apache Falcon Messaging ........................... SUCCESS [3.367s]
[INFO] Apache Falcon Oozie Adaptor ....................... SUCCESS [5.759s]
[INFO] Apache Falcon Feed ................................ SUCCESS [3.078s]
[INFO] Apache Falcon Process ............................. SUCCESS [3.385s]
[INFO] Apache Falcon Acquisition ......................... SUCCESS [0.212s]
[INFO] Apache Falcon Replication ......................... SUCCESS [2.520s]
[INFO] Apache Falcon Retention ........................... SUCCESS [3.091s]
[INFO] Apache Falcon Archival ............................ SUCCESS [0.263s]
[INFO] Apache Falcon Rerun ............................... SUCCESS [3.266s]
[INFO] Apache Falcon Prism ............................... SUCCESS [16.373s]
[INFO] Apache Falcon Web Application ..................... SUCCESS [1:22.759s]
[INFO] Apache Falcon Documentation ....................... SUCCESS [35.297s]
[INFO] ------------------------------------------------------------------------
[INFO] BUILD SUCCESS
[INFO] ------------------------------------------------------------------------
[INFO] Total time: 3:18.597s
[INFO] Finished at: Mon Mar 03 15:37:51 IST 2014
[INFO] Final Memory: 285M/704M
[INFO] ------------------------------------------------------------------------
[INFO] Shutdown hook executing
[INFO] Shutdown hook complete
Shutting down hive metastore.


> Build fails for the module 'Apache Falcon CLI client ' on ubuntu
> ----------------------------------------------------------------
>
>                 Key: FALCON-330
>                 URL: https://issues.apache.org/jira/browse/FALCON-330
>             Project: Falcon
>          Issue Type: Bug
>          Components: client
>    Affects Versions: 0.5
>         Environment: deepakm@deepakm-laptop:~$ uname -a
> Linux deepakm-laptop 2.6.32-38-generic #83-Ubuntu SMP Wed Jan 4 11:13:04 UTC 2012 i686
GNU/Linux
> deepakm@deepakm-laptop:~$ mvn -version
> Apache Maven 3.1.1 (0728685237757ffbf44136acec0402957f723d9a; 2013-09-17 20:52:22+0530)
> Maven home: /data/mybin/apache-maven-3.1.1
> Java version: 1.6.0_20, vendor: Sun Microsystems Inc.
> Java home: /usr/lib/jvm/java-6-openjdk/jre
> Default locale: en_US, platform encoding: UTF-8
> OS name: "linux", version: "2.6.32-38-generic", arch: "i386", family: "unix"
>            Reporter: Deepak Marathe
>            Assignee: Deepak Marathe
>             Fix For: 0.5
>
>
> deepakm@deepakm-laptop:/data/Falcon/falcon$ git pull
> Already up-to-date.
> deepakm@deepakm-laptop:/data/Falcon/falcon$ export MAVEN_OPTS="-Xmx1024m -XX:MaxPermSize=256m"
&& mvn clean install -U
> [INFO] ------------------------------------------------------------------------
> [INFO] Building Apache Falcon CLI client 0.5-incubating-SNAPSHOT
> [INFO] ------------------------------------------------------------------------
> [INFO] 
> [INFO] --- maven-clean-plugin:2.5:clean (default-clean) @ falcon-client ---
> [INFO] Deleting /data/Falcon/falcon/client/target
> [INFO] 
> [INFO] --- maven-enforcer-plugin:1.3.1:enforce (enforce-property) @ falcon-client ---
> [INFO] 
> [INFO] --- buildnumber-maven-plugin:1.0:create (default) @ falcon-client ---
> [INFO] Checking for local modifications: skipped.
> [INFO] Updating project files from SCM: skipped.
> [INFO] Executing: /bin/sh -c cd /data/Falcon/falcon/client && git show
> [INFO] Working directory: /data/Falcon/falcon/client
> [INFO] Storing buildNumber: b42f740a886f436fba95eb0a4758f8439d1d8a0b at timestamp: 1393839918155
> [INFO] Executing: /bin/sh -c cd /data/Falcon/falcon/client && git show
> [INFO] Working directory: /data/Falcon/falcon/client
> [INFO] Storing buildScmBranch: UNKNOWN
> [INFO] 
> [INFO] --- maven-jaxb2-plugin:0.8.0:generate (1) @ falcon-client ---
> [ERROR] Error while parsing schema(s).Location [ file:/data/Falcon/falcon/client/src/main/resources/jaxb-binding.xjb{25,53}].
> org.xml.sax.SAXParseException; systemId: file:/data/Falcon/falcon/client/src/main/resources/jaxb-binding.xjb;
lineNumber: 25; columnNumber: 53; Both jaxb:version and version are present
> 	at com.sun.tools.xjc.reader.internalizer.VersionChecker.startElement(VersionChecker.java:115)
> 	at org.xml.sax.helpers.XMLFilterImpl.startElement(XMLFilterImpl.java:551)
> 	at com.sun.tools.xjc.reader.internalizer.AbstractReferenceFinderImpl.startElement(AbstractReferenceFinderImpl.java:91)
> 	at com.sun.org.apache.xerces.internal.parsers.AbstractSAXParser.startElement(AbstractSAXParser.java:504)
> 	at com.sun.org.apache.xerces.internal.impl.XMLNSDocumentScannerImpl.scanStartElement(XMLNSDocumentScannerImpl.java:376)
> 	at com.sun.org.apache.xerces.internal.impl.XMLNSDocumentScannerImpl$NSContentDriver.scanRootElementHook(XMLNSDocumentScannerImpl.java:602)
> 	at com.sun.org.apache.xerces.internal.impl.XMLDocumentFragmentScannerImpl$FragmentContentDriver.next(XMLDocumentFragmentScannerImpl.java:3080)
> 	at com.sun.org.apache.xerces.internal.impl.XMLDocumentScannerImpl$PrologDriver.next(XMLDocumentScannerImpl.java:899)
> 	at com.sun.org.apache.xerces.internal.impl.XMLDocumentScannerImpl.next(XMLDocumentScannerImpl.java:625)
> 	at com.sun.org.apache.xerces.internal.impl.XMLNSDocumentScannerImpl.next(XMLNSDocumentScannerImpl.java:116)
> 	at com.sun.org.apache.xerces.internal.impl.XMLDocumentFragmentScannerImpl.scanDocument(XMLDocumentFragmentScannerImpl.java:488)
> 	at com.sun.org.apache.xerces.internal.parsers.XML11Configuration.parse(XML11Configuration.java:812)
> 	at com.sun.org.apache.xerces.internal.parsers.XML11Configuration.parse(XML11Configuration.java:741)
> 	at com.sun.org.apache.xerces.internal.parsers.XMLParser.parse(XMLParser.java:123)
> 	at com.sun.org.apache.xerces.internal.parsers.AbstractSAXParser.parse(AbstractSAXParser.java:1208)
> 	at com.sun.org.apache.xerces.internal.jaxp.SAXParserImpl$JAXPSAXParser.parse(SAXParserImpl.java:525)
> 	at com.sun.tools.xjc.reader.internalizer.DOMForest.parse(DOMForest.java:398)
> 	at com.sun.tools.xjc.reader.internalizer.DOMForest.parse(DOMForest.java:278)
> 	at com.sun.tools.xjc.ModelLoader.buildDOMForest(ModelLoader.java:328)
> 	at com.sun.tools.xjc.ModelLoader.loadXMLSchema(ModelLoader.java:375)
> 	at com.sun.tools.xjc.ModelLoader.load(ModelLoader.java:172)
> 	at com.sun.tools.xjc.ModelLoader.load(ModelLoader.java:118)
> 	at org.jvnet.mjiip.v_2_2.XJC22Mojo.loadModel(XJC22Mojo.java:45)
> 	at org.jvnet.mjiip.v_2_2.XJC22Mojo.doExecute(XJC22Mojo.java:35)
> 	at org.jvnet.mjiip.v_2_2.XJC22Mojo.doExecute(XJC22Mojo.java:22)
> 	at org.jvnet.jaxb2.maven2.RawXJC2Mojo.doExecute(RawXJC2Mojo.java:282)
> 	at org.jvnet.jaxb2.maven2.RawXJC2Mojo.execute(RawXJC2Mojo.java:147)
> 	at org.apache.maven.plugin.DefaultBuildPluginManager.executeMojo(DefaultBuildPluginManager.java:106)
> 	at org.apache.maven.lifecycle.internal.MojoExecutor.execute(MojoExecutor.java:208)
> 	at org.apache.maven.lifecycle.internal.MojoExecutor.execute(MojoExecutor.java:153)
> 	at org.apache.maven.lifecycle.internal.MojoExecutor.execute(MojoExecutor.java:145)
> 	at org.apache.maven.lifecycle.internal.LifecycleModuleBuilder.buildProject(LifecycleModuleBuilder.java:84)
> 	at org.apache.maven.lifecycle.internal.LifecycleModuleBuilder.buildProject(LifecycleModuleBuilder.java:59)
> 	at org.apache.maven.lifecycle.internal.LifecycleStarter.singleThreadedBuild(LifecycleStarter.java:183)
> 	at org.apache.maven.lifecycle.internal.LifecycleStarter.execute(LifecycleStarter.java:161)
> 	at org.apache.maven.DefaultMaven.doExecute(DefaultMaven.java:317)
> 	at org.apache.maven.DefaultMaven.execute(DefaultMaven.java:152)
> 	at org.apache.maven.cli.MavenCli.execute(MavenCli.java:555)
> 	at org.apache.maven.cli.MavenCli.doMain(MavenCli.java:214)
> 	at org.apache.maven.cli.MavenCli.main(MavenCli.java:158)
> 	at sun.reflect.NativeMethodAccessorImpl.invoke0(Native Method)
> 	at sun.reflect.NativeMethodAccessorImpl.invoke(NativeMethodAccessorImpl.java:57)
> 	at sun.reflect.DelegatingMethodAccessorImpl.invoke(DelegatingMethodAccessorImpl.java:43)
> 	at java.lang.reflect.Method.invoke(Method.java:616)
> 	at org.codehaus.plexus.classworlds.launcher.Launcher.launchEnhanced(Launcher.java:289)
> 	at org.codehaus.plexus.classworlds.launcher.Launcher.launch(Launcher.java:229)
> 	at org.codehaus.plexus.classworlds.launcher.Launcher.mainWithExitCode(Launcher.java:415)
> 	at org.codehaus.plexus.classworlds.launcher.Launcher.main(Launcher.java:356)
> [INFO] ------------------------------------------------------------------------
> [INFO] Reactor Summary:
> [INFO] 
> [INFO] Checkstyle ........................................ SUCCESS [2.323s]
> [INFO] Apache Falcon ..................................... SUCCESS [5.219s]
> [INFO] Build Tools ....................................... SUCCESS [4.306s]
> [INFO] Apache Falcon CLI client .......................... FAILURE [2.739s]
> [INFO] Apache Falcon Metrics ............................. SKIPPED
> [INFO] Apache Falcon Hadoop Dependencies ................. SKIPPED
> [INFO] Apache Falcon Test Utility ........................ SKIPPED
> [INFO] Apache Falcon Commons ............................. SKIPPED
> [INFO] Apache Falcon Oozie EL Extension .................. SKIPPED
> [INFO] Apache Falcon Embedded Hadoop - Test Cluster ...... SKIPPED
> [INFO] Apache Falcon Messaging ........................... SKIPPED
> [INFO] Apache Falcon Oozie Adaptor ....................... SKIPPED
> [INFO] Apache Falcon Feed ................................ SKIPPED
> [INFO] Apache Falcon Process ............................. SKIPPED
> [INFO] Apache Falcon Acquisition ......................... SKIPPED
> [INFO] Apache Falcon Replication ......................... SKIPPED
> [INFO] Apache Falcon Retention ........................... SKIPPED
> [INFO] Apache Falcon Archival ............................ SKIPPED
> [INFO] Apache Falcon Rerun ............................... SKIPPED
> [INFO] Apache Falcon Prism ............................... SKIPPED
> [INFO] Apache Falcon Web Application ..................... SKIPPED
> [INFO] Apache Falcon Documentation ....................... SKIPPED
> [INFO] ------------------------------------------------------------------------
> [INFO] BUILD FAILURE
> [INFO] ------------------------------------------------------------------------
> [INFO] Total time: 15.498s
> [INFO] Finished at: Mon Mar 03 15:15:20 IST 2014
> [INFO] Final Memory: 21M/51M
> [INFO] ------------------------------------------------------------------------
> [ERROR] Failed to execute goal org.jvnet.jaxb2.maven2:maven-jaxb2-plugin:0.8.0:generate
(1) on project falcon-client: Unable to parse input schema(s). Error messages should have
been provided. -> [Help 1]
> [ERROR] 
> [ERROR] To see the full stack trace of the errors, re-run Maven with the -e switch.
> [ERROR] Re-run Maven using the -X switch to enable full debug logging.
> [ERROR] 
> [ERROR] For more information about the errors and possible solutions, please read the
following articles:
> [ERROR] [Help 1] http://cwiki.apache.org/confluence/display/MAVEN/MojoExecutionException
> [ERROR] 
> [ERROR] After correcting the problems, you can resume the build with the command
> [ERROR]   mvn <goals> -rf :falcon-client



--
This message was sent by Atlassian JIRA
(v6.2#6252)

Mime
View raw message