falcon-dev mailing list archives

Site index · List index
Message view « Date » · « Thread »
Top « Date » · « Thread »
From "Venkatesh Seetharam (JIRA)" <j...@apache.org>
Subject [jira] [Commented] (FALCON-275) Messaging tests fail
Date Wed, 05 Mar 2014 01:29:42 GMT

    [ https://issues.apache.org/jira/browse/FALCON-275?page=com.atlassian.jira.plugin.system.issuetabpanels:comment-tabpanel&focusedCommentId=13920365#comment-13920365
] 

Venkatesh Seetharam commented on FALCON-275:
--------------------------------------------

I took care of this as part of FALCON-11

> Messaging tests fail
> --------------------
>
>                 Key: FALCON-275
>                 URL: https://issues.apache.org/jira/browse/FALCON-275
>             Project: Falcon
>          Issue Type: Test
>          Components: messaging, tests
>            Reporter: Jean-Baptiste Onofré
>            Assignee: Jean-Baptiste Onofré
>
> On master, the messaging FeedProducerTest fails:
> Tests run: 2, Failures: 1, Errors: 0, Skipped: 0, Time elapsed: 3.153 sec <<<
FAILURE! - in org.apache.falcon.messaging.FeedProducerTest
> testLogFile(org.apache.falcon.messaging.FeedProducerTest)  Time elapsed: 0.326 sec  <<<
FAILURE!
> java.lang.AssertionError: expected:</falcon/feed/agg-logs/path1/2010/10/10/20>
but was:</falcon/feed/agg-logs/path1/2010/10/10/21>



--
This message was sent by Atlassian JIRA
(v6.2#6252)

Mime
View raw message