falcon-dev mailing list archives

Site index · List index
Message view « Date » · « Thread »
Top « Date » · « Thread »
From Apache Jenkins Server <jenk...@builds.apache.org>
Subject Build failed in Jenkins: Apache-falcon #208
Date Fri, 21 Feb 2014 12:44:16 GMT
See <https://builds.apache.org/job/Apache-falcon/208/>

------------------------------------------
[...truncated 8341 lines...]
-------------------------------------------------------

-------------------------------------------------------
 T E S T S
-------------------------------------------------------
Starting hive metastore on port 49083
Running org.apache.falcon.process.TableStorageProcessIT
Tests run: 0, Failures: 0, Errors: 0, Skipped: 0, Time elapsed: 1.322 sec - in org.apache.falcon.process.TableStorageProcessIT
Running org.apache.falcon.process.PigProcessIT
Tests run: 0, Failures: 0, Errors: 0, Skipped: 0, Time elapsed: 2.754 sec - in org.apache.falcon.process.PigProcessIT
Running org.apache.falcon.lifecycle.FileSystemFeedReplicationIT
Tests run: 0, Failures: 0, Errors: 0, Skipped: 0, Time elapsed: 1.959 sec - in org.apache.falcon.lifecycle.FileSystemFeedReplicationIT
Running org.apache.falcon.lifecycle.TableStorageFeedEvictorIT
Tests run: 14, Failures: 0, Errors: 0, Skipped: 0, Time elapsed: 23.331 sec - in org.apache.falcon.lifecycle.TableStorageFeedEvictorIT
Running org.apache.falcon.lifecycle.TableStorageFeedReplicationIT
Tests run: 0, Failures: 0, Errors: 0, Skipped: 0, Time elapsed: 1.458 sec - in org.apache.falcon.lifecycle.TableStorageFeedReplicationIT
Running org.apache.falcon.cli.FalconCLISmokeIT
Tests run: 1, Failures: 0, Errors: 0, Skipped: 0, Time elapsed: 13.456 sec - in org.apache.falcon.cli.FalconCLISmokeIT
Running org.apache.falcon.cli.FalconCLIIT
Tests run: 22, Failures: 0, Errors: 0, Skipped: 0, Time elapsed: 51.003 sec - in org.apache.falcon.cli.FalconCLIIT
Running org.apache.falcon.catalog.HiveCatalogServiceIT
Tests run: 22, Failures: 0, Errors: 0, Skipped: 0, Time elapsed: 16.349 sec - in org.apache.falcon.catalog.HiveCatalogServiceIT
Running org.apache.falcon.validation.FeedEntityValidationIT
Tests run: 8, Failures: 0, Errors: 0, Skipped: 0, Time elapsed: 5.771 sec - in org.apache.falcon.validation.FeedEntityValidationIT
Running org.apache.falcon.validation.ClusterEntityValidationIT
Tests run: 12, Failures: 0, Errors: 0, Skipped: 0, Time elapsed: 6.141 sec - in org.apache.falcon.validation.ClusterEntityValidationIT
Running org.apache.falcon.resource.EntityManagerJerseyIT
Tests run: 22, Failures: 1, Errors: 0, Skipped: 0, Time elapsed: 92.627 sec <<< FAILURE!
- in org.apache.falcon.resource.EntityManagerJerseyIT
testProcessInputUpdate(org.apache.falcon.resource.EntityManagerJerseyIT)  Time elapsed: 4.129
sec  <<< FAILURE!
java.lang.AssertionError: expected:<Sat Feb 22 12:00:00 UTC 2014> but was:<Sun Feb
23 00:00:00 UTC 2014>
	at org.testng.Assert.fail(Assert.java:89)
	at org.testng.Assert.failNotEquals(Assert.java:489)
	at org.testng.Assert.assertEquals(Assert.java:118)
	at org.testng.Assert.assertEquals(Assert.java:160)
	at org.apache.falcon.resource.EntityManagerJerseyIT.testProcessInputUpdate(EntityManagerJerseyIT.java:309)

Running org.apache.falcon.resource.EntityManagerJerseySmokeIT
Tests run: 2, Failures: 0, Errors: 0, Skipped: 0, Time elapsed: 35.676 sec - in org.apache.falcon.resource.EntityManagerJerseySmokeIT
Running org.apache.falcon.resource.ProcessInstanceManagerIT
Tests run: 0, Failures: 0, Errors: 0, Skipped: 0, Time elapsed: 0.262 sec - in org.apache.falcon.resource.ProcessInstanceManagerIT
Running org.apache.falcon.late.LateDataHandlerIT
Tests run: 2, Failures: 0, Errors: 0, Skipped: 0, Time elapsed: 6.959 sec - in org.apache.falcon.late.LateDataHandlerIT

Results :

Failed tests: 
  EntityManagerJerseyIT.testProcessInputUpdate:309 expected:<Sat Feb 22 12:00:00 UTC 2014>
but was:<Sun Feb 23 00:00:00 UTC 2014>

Tests run: 105, Failures: 1, Errors: 0, Skipped: 0

[INFO] 
[INFO] --- maven-jetty-plugin:6.1.26:stop (stop-jetty) @ falcon-webapp ---
[INFO] 
[INFO] --- maven-failsafe-plugin:2.16:verify (verify) @ falcon-webapp ---
[INFO] Stopping server 0
2014-02-21 12:42:34.927:INFO::Stopped SelectChannelConnector@0.0.0.0:41000
[INFO] Failsafe report directory: <https://builds.apache.org/job/Apache-falcon/ws/webapp/target/failsafe-reports>
[INFO] ------------------------------------------------------------------------
[INFO] Reactor Summary:
[INFO] 
[INFO] Checkstyle ........................................ SUCCESS [1.054s]
[INFO] Apache Falcon ..................................... SUCCESS [4.792s]
[INFO] Build Tools ....................................... SUCCESS [1:02.860s]
[INFO] Apache Falcon CLI client .......................... SUCCESS [29.585s]
[INFO] Apache Falcon Metrics ............................. SUCCESS [11.161s]
[INFO] Apache Falcon Hadoop Dependencies ................. SUCCESS [12.557s]
[INFO] Apache Falcon Test Utility ........................ SUCCESS [10.096s]
[INFO] Apache Falcon Commons ............................. SUCCESS [57.363s]
[INFO] Apache Falcon Oozie EL Extension .................. SUCCESS [14.117s]
[INFO] Apache Falcon Embedded Hadoop - Test Cluster ...... SUCCESS [27.447s]
[INFO] Apache Falcon Messaging ........................... SUCCESS [21.237s]
[INFO] Apache Falcon Oozie Adaptor ....................... SUCCESS [28.660s]
[INFO] Apache Falcon Feed ................................ SUCCESS [19.299s]
[INFO] Apache Falcon Process ............................. SUCCESS [24.113s]
[INFO] Apache Falcon Acquisition ......................... SUCCESS [0.605s]
[INFO] Apache Falcon Replication ......................... SUCCESS [16.021s]
[INFO] Apache Falcon Retention ........................... SUCCESS [17.591s]
[INFO] Apache Falcon Archival ............................ SUCCESS [0.607s]
[INFO] Apache Falcon Rerun ............................... SUCCESS [26.097s]
[INFO] Apache Falcon Prism ............................... SUCCESS [43.639s]
[INFO] Apache Falcon Web Application ..................... FAILURE [4:56.657s]
[INFO] Apache Falcon Documentation ....................... SKIPPED
[INFO] ------------------------------------------------------------------------
[INFO] BUILD FAILURE
[INFO] ------------------------------------------------------------------------
[INFO] Total time: 12:06.186s
[INFO] Finished at: Fri Feb 21 12:42:34 UTC 2014
[INFO] Final Memory: 310M/725M
[INFO] ------------------------------------------------------------------------
[ERROR] Failed to execute goal org.apache.maven.plugins:maven-failsafe-plugin:2.16:verify
(verify) on project falcon-webapp: There are test failures.
[ERROR] 
[ERROR] Please refer to <https://builds.apache.org/job/Apache-falcon/ws/webapp/target/failsafe-reports>
for the individual test results.
[ERROR] -> [Help 1]
[ERROR] 
[ERROR] To see the full stack trace of the errors, re-run Maven with the -e switch.
[ERROR] Re-run Maven using the -X switch to enable full debug logging.
[ERROR] 
[ERROR] For more information about the errors and possible solutions, please read the following
articles:
[ERROR] [Help 1] http://cwiki.apache.org/confluence/display/MAVEN/MojoFailureException
[ERROR] 
[ERROR] After correcting the problems, you can resume the build with the command
[ERROR]   mvn <goals> -rf :falcon-webapp
2014-02-21 12:42:36.725:INFO::Shutdown hook executing
Shutting down hive metastore.
2014-02-21 12:43:07.871:INFO::Shutdown hook complete
Build step 'Execute shell' marked build as failure
[CHECKSTYLE] Collecting checkstyle analysis files...
[CHECKSTYLE] Finding all files that match the pattern **/target/checkstyle-result.xml
[CHECKSTYLE] Parsing 52 files in <https://builds.apache.org/job/Apache-falcon/ws/>
[CHECKSTYLE] Successfully parsed file <https://builds.apache.org/job/Apache-falcon/ws/acquisition/target/checkstyle-result.xml>
of module  with 0 warnings.
[CHECKSTYLE] Successfully parsed file <https://builds.apache.org/job/Apache-falcon/ws/archival/target/checkstyle-result.xml>
of module  with 0 warnings.
[CHECKSTYLE] Successfully parsed file <https://builds.apache.org/job/Apache-falcon/ws/build-tools/target/checkstyle-result.xml>
of module  with 0 warnings.
[CHECKSTYLE] Successfully parsed file <https://builds.apache.org/job/Apache-falcon/ws/client/target/checkstyle-result.xml>
of module  with 0 warnings.
[CHECKSTYLE] Successfully parsed file <https://builds.apache.org/job/Apache-falcon/ws/common/target/checkstyle-result.xml>
of module  with 0 warnings.
[CHECKSTYLE] Successfully parsed file <https://builds.apache.org/job/Apache-falcon/ws/docs/target/checkstyle-result.xml>
of module  with 0 warnings.
[CHECKSTYLE] Successfully parsed file <https://builds.apache.org/job/Apache-falcon/ws/feed/target/checkstyle-result.xml>
of module  with 0 warnings.
[CHECKSTYLE] Successfully parsed file <https://builds.apache.org/job/Apache-falcon/ws/hadoop-dependencies/target/checkstyle-result.xml>
of module  with 0 warnings.
[CHECKSTYLE] Successfully parsed file <https://builds.apache.org/job/Apache-falcon/ws/hadoop-webapp/target/checkstyle-result.xml>
of module  with 0 warnings.
[CHECKSTYLE] Successfully parsed file <https://builds.apache.org/job/Apache-falcon/ws/messaging/target/checkstyle-result.xml>
of module  with 0 warnings.
[CHECKSTYLE] Successfully parsed file <https://builds.apache.org/job/Apache-falcon/ws/metrics/target/checkstyle-result.xml>
of module  with 0 warnings.
[CHECKSTYLE] Successfully parsed file <https://builds.apache.org/job/Apache-falcon/ws/oozie-el-extensions/target/checkstyle-result.xml>
of module  with 0 warnings.
[CHECKSTYLE] Successfully parsed file <https://builds.apache.org/job/Apache-falcon/ws/oozie/target/checkstyle-result.xml>
of module  with 0 warnings.
[CHECKSTYLE] Successfully parsed file <https://builds.apache.org/job/Apache-falcon/ws/prism/target/checkstyle-result.xml>
of module  with 0 warnings.
[CHECKSTYLE] Successfully parsed file <https://builds.apache.org/job/Apache-falcon/ws/process/target/checkstyle-result.xml>
of module  with 0 warnings.
[CHECKSTYLE] Successfully parsed file <https://builds.apache.org/job/Apache-falcon/ws/replication/target/checkstyle-result.xml>
of module  with 0 warnings.
[CHECKSTYLE] Successfully parsed file <https://builds.apache.org/job/Apache-falcon/ws/rerun/target/checkstyle-result.xml>
of module  with 0 warnings.
[CHECKSTYLE] Successfully parsed file <https://builds.apache.org/job/Apache-falcon/ws/retention/target/checkstyle-result.xml>
of module  with 0 warnings.
[CHECKSTYLE] Successfully parsed file <https://builds.apache.org/job/Apache-falcon/ws/target/checkstyle-result.xml>
of module  with 0 warnings.
[CHECKSTYLE] Successfully parsed file <https://builds.apache.org/job/Apache-falcon/ws/target/oozie-4.0.0/client/target/checkstyle-result.xml>
of module  with 81 warnings.
[CHECKSTYLE] Successfully parsed file <https://builds.apache.org/job/Apache-falcon/ws/target/oozie-4.0.0/core/target/checkstyle-result.xml>
of module  with 1937 warnings.
[CHECKSTYLE] Successfully parsed file <https://builds.apache.org/job/Apache-falcon/ws/target/oozie-4.0.0/distro/target/checkstyle-result.xml>
of module  with 0 warnings.
[CHECKSTYLE] Successfully parsed file <https://builds.apache.org/job/Apache-falcon/ws/target/oozie-4.0.0/docs/target/checkstyle-result.xml>
of module  with 3 warnings.
[CHECKSTYLE] Successfully parsed file <https://builds.apache.org/job/Apache-falcon/ws/target/oozie-4.0.0/examples/target/checkstyle-result.xml>
of module  with 34 warnings.
[CHECKSTYLE] Successfully parsed file <https://builds.apache.org/job/Apache-falcon/ws/target/oozie-4.0.0/hadooplibs/hadoop-0.23/target/checkstyle-result.xml>
of module  with 0 warnings.
[CHECKSTYLE] Successfully parsed file <https://builds.apache.org/job/Apache-falcon/ws/target/oozie-4.0.0/hadooplibs/hadoop-1/target/checkstyle-result.xml>
of module  with 0 warnings.
[CHECKSTYLE] Successfully parsed file <https://builds.apache.org/job/Apache-falcon/ws/target/oozie-4.0.0/hadooplibs/hadoop-2/target/checkstyle-result.xml>
of module  with 0 warnings.
[CHECKSTYLE] Successfully parsed file <https://builds.apache.org/job/Apache-falcon/ws/target/oozie-4.0.0/hadooplibs/hadoop-distcp-0.23/target/checkstyle-result.xml>
of module  with 0 warnings.
[CHECKSTYLE] Successfully parsed file <https://builds.apache.org/job/Apache-falcon/ws/target/oozie-4.0.0/hadooplibs/hadoop-distcp-1/target/checkstyle-result.xml>
of module  with 0 warnings.
[CHECKSTYLE] Successfully parsed file <https://builds.apache.org/job/Apache-falcon/ws/target/oozie-4.0.0/hadooplibs/hadoop-distcp-2/target/checkstyle-result.xml>
of module  with 0 warnings.
[CHECKSTYLE] Successfully parsed file <https://builds.apache.org/job/Apache-falcon/ws/target/oozie-4.0.0/hadooplibs/hadoop-test-0.23/target/checkstyle-result.xml>
of module  with 0 warnings.
[CHECKSTYLE] Successfully parsed file <https://builds.apache.org/job/Apache-falcon/ws/target/oozie-4.0.0/hadooplibs/hadoop-test-1/target/checkstyle-result.xml>
of module  with 0 warnings.
[CHECKSTYLE] Successfully parsed file <https://builds.apache.org/job/Apache-falcon/ws/target/oozie-4.0.0/hadooplibs/hadoop-test-2/target/checkstyle-result.xml>
of module  with 0 warnings.
[CHECKSTYLE] Successfully parsed file <https://builds.apache.org/job/Apache-falcon/ws/target/oozie-4.0.0/hadooplibs/target/checkstyle-result.xml>
of module  with 0 warnings.
[CHECKSTYLE] Successfully parsed file <https://builds.apache.org/job/Apache-falcon/ws/target/oozie-4.0.0/hbaselibs/hbase-0.94/target/checkstyle-result.xml>
of module  with 0 warnings.
[CHECKSTYLE] Successfully parsed file <https://builds.apache.org/job/Apache-falcon/ws/target/oozie-4.0.0/hbaselibs/target/checkstyle-result.xml>
of module  with 0 warnings.
[CHECKSTYLE] Successfully parsed file <https://builds.apache.org/job/Apache-falcon/ws/target/oozie-4.0.0/hcataloglibs/hcatalog-0.5/target/checkstyle-result.xml>
of module  with 0 warnings.
[CHECKSTYLE] Successfully parsed file <https://builds.apache.org/job/Apache-falcon/ws/target/oozie-4.0.0/hcataloglibs/hcatalog-0.6/target/checkstyle-result.xml>
of module  with 0 warnings.
[CHECKSTYLE] Successfully parsed file <https://builds.apache.org/job/Apache-falcon/ws/target/oozie-4.0.0/hcataloglibs/target/checkstyle-result.xml>
of module  with 0 warnings.
[CHECKSTYLE] Successfully parsed file <https://builds.apache.org/job/Apache-falcon/ws/target/oozie-4.0.0/minitest/target/checkstyle-result.xml>
of module  with 0 warnings.
[CHECKSTYLE] Successfully parsed file <https://builds.apache.org/job/Apache-falcon/ws/target/oozie-4.0.0/sharelib/distcp/target/checkstyle-result.xml>
of module  with 0 warnings.
[CHECKSTYLE] Successfully parsed file <https://builds.apache.org/job/Apache-falcon/ws/target/oozie-4.0.0/sharelib/hcatalog/target/checkstyle-result.xml>
of module  with 3 warnings.
[CHECKSTYLE] Successfully parsed file <https://builds.apache.org/job/Apache-falcon/ws/target/oozie-4.0.0/sharelib/hive/target/checkstyle-result.xml>
of module  with 3 warnings.
[CHECKSTYLE] Successfully parsed file <https://builds.apache.org/job/Apache-falcon/ws/target/oozie-4.0.0/sharelib/oozie/target/checkstyle-result.xml>
of module  with 22 warnings.
[CHECKSTYLE] Successfully parsed file <https://builds.apache.org/job/Apache-falcon/ws/target/oozie-4.0.0/sharelib/pig/target/checkstyle-result.xml>
of module  with 8 warnings.
[CHECKSTYLE] Successfully parsed file <https://builds.apache.org/job/Apache-falcon/ws/target/oozie-4.0.0/sharelib/sqoop/target/checkstyle-result.xml>
of module  with 2 warnings.
[CHECKSTYLE] Successfully parsed file <https://builds.apache.org/job/Apache-falcon/ws/target/oozie-4.0.0/sharelib/streaming/target/checkstyle-result.xml>
of module  with 4 warnings.
[CHECKSTYLE] Successfully parsed file <https://builds.apache.org/job/Apache-falcon/ws/target/oozie-4.0.0/sharelib/target/checkstyle-result.xml>
of module  with 0 warnings.
[CHECKSTYLE] Successfully parsed file <https://builds.apache.org/job/Apache-falcon/ws/target/oozie-4.0.0/target/checkstyle-result.xml>
of module  with 0 warnings.
[CHECKSTYLE] Successfully parsed file <https://builds.apache.org/job/Apache-falcon/ws/target/oozie-4.0.0/tools/target/checkstyle-result.xml>
of module  with 9 warnings.
[CHECKSTYLE] Successfully parsed file <https://builds.apache.org/job/Apache-falcon/ws/target/oozie-4.0.0/webapp/target/checkstyle-result.xml>
of module  with 0 warnings.
[CHECKSTYLE] Successfully parsed file <https://builds.apache.org/job/Apache-falcon/ws/test-util/target/checkstyle-result.xml>
of module  with 0 warnings.
[FINDBUGS] Collecting findbugs analysis files...
[FINDBUGS] Finding all files that match the pattern **/target/findbugs.xml
[FINDBUGS] Parsing 15 files in <https://builds.apache.org/job/Apache-falcon/ws/>
[FINDBUGS] Successfully parsed file <https://builds.apache.org/job/Apache-falcon/ws/client/target/findbugs.xml>
of module  with 0 warnings.
[FINDBUGS] Successfully parsed file <https://builds.apache.org/job/Apache-falcon/ws/common/target/findbugs.xml>
of module  with 0 warnings.
[FINDBUGS] Successfully parsed file <https://builds.apache.org/job/Apache-falcon/ws/feed/target/findbugs.xml>
of module  with 0 warnings.
[FINDBUGS] Successfully parsed file <https://builds.apache.org/job/Apache-falcon/ws/hadoop-dependencies/target/findbugs.xml>
of module  with 0 warnings.
[FINDBUGS] Successfully parsed file <https://builds.apache.org/job/Apache-falcon/ws/hadoop-webapp/target/findbugs.xml>
of module  with 0 warnings.
[FINDBUGS] Successfully parsed file <https://builds.apache.org/job/Apache-falcon/ws/messaging/target/findbugs.xml>
of module  with 0 warnings.
[FINDBUGS] Successfully parsed file <https://builds.apache.org/job/Apache-falcon/ws/metrics/target/findbugs.xml>
of module  with 0 warnings.
[FINDBUGS] Successfully parsed file <https://builds.apache.org/job/Apache-falcon/ws/oozie-el-extensions/target/findbugs.xml>
of module  with 0 warnings.
[FINDBUGS] Successfully parsed file <https://builds.apache.org/job/Apache-falcon/ws/oozie/target/findbugs.xml>
of module  with 0 warnings.
[FINDBUGS] Successfully parsed file <https://builds.apache.org/job/Apache-falcon/ws/prism/target/findbugs.xml>
of module  with 0 warnings.
[FINDBUGS] Successfully parsed file <https://builds.apache.org/job/Apache-falcon/ws/process/target/findbugs.xml>
of module  with 0 warnings.
[FINDBUGS] Successfully parsed file <https://builds.apache.org/job/Apache-falcon/ws/replication/target/findbugs.xml>
of module  with 0 warnings.
[FINDBUGS] Successfully parsed file <https://builds.apache.org/job/Apache-falcon/ws/rerun/target/findbugs.xml>
of module  with 0 warnings.
[FINDBUGS] Successfully parsed file <https://builds.apache.org/job/Apache-falcon/ws/retention/target/findbugs.xml>
of module  with 0 warnings.
[FINDBUGS] Successfully parsed file <https://builds.apache.org/job/Apache-falcon/ws/test-util/target/findbugs.xml>
of module  with 0 warnings.
Archiving artifacts
TestNG Reports Processing: START
Looking for TestNG results report in workspace using pattern: **/target/surefire-reports/*.xml
Saving reports...
Processing '/x1/jenkins/jenkins-home/jobs/Apache-falcon/builds/2014-02-21_12-30-22/testng/testng-results-1.xml'
Processing '/x1/jenkins/jenkins-home/jobs/Apache-falcon/builds/2014-02-21_12-30-22/testng/testng-results-10.xml'
Processing '/x1/jenkins/jenkins-home/jobs/Apache-falcon/builds/2014-02-21_12-30-22/testng/testng-results-11.xml'
Processing '/x1/jenkins/jenkins-home/jobs/Apache-falcon/builds/2014-02-21_12-30-22/testng/testng-results-12.xml'
Processing '/x1/jenkins/jenkins-home/jobs/Apache-falcon/builds/2014-02-21_12-30-22/testng/testng-results-13.xml'
Processing '/x1/jenkins/jenkins-home/jobs/Apache-falcon/builds/2014-02-21_12-30-22/testng/testng-results-14.xml'
Processing '/x1/jenkins/jenkins-home/jobs/Apache-falcon/builds/2014-02-21_12-30-22/testng/testng-results-15.xml'
Processing '/x1/jenkins/jenkins-home/jobs/Apache-falcon/builds/2014-02-21_12-30-22/testng/testng-results-16.xml'
Processing '/x1/jenkins/jenkins-home/jobs/Apache-falcon/builds/2014-02-21_12-30-22/testng/testng-results-17.xml'
Processing '/x1/jenkins/jenkins-home/jobs/Apache-falcon/builds/2014-02-21_12-30-22/testng/testng-results-18.xml'
Processing '/x1/jenkins/jenkins-home/jobs/Apache-falcon/builds/2014-02-21_12-30-22/testng/testng-results-19.xml'
Processing '/x1/jenkins/jenkins-home/jobs/Apache-falcon/builds/2014-02-21_12-30-22/testng/testng-results-2.xml'
Processing '/x1/jenkins/jenkins-home/jobs/Apache-falcon/builds/2014-02-21_12-30-22/testng/testng-results-20.xml'
Processing '/x1/jenkins/jenkins-home/jobs/Apache-falcon/builds/2014-02-21_12-30-22/testng/testng-results-21.xml'
Processing '/x1/jenkins/jenkins-home/jobs/Apache-falcon/builds/2014-02-21_12-30-22/testng/testng-results-22.xml'
Processing '/x1/jenkins/jenkins-home/jobs/Apache-falcon/builds/2014-02-21_12-30-22/testng/testng-results-23.xml'
Processing '/x1/jenkins/jenkins-home/jobs/Apache-falcon/builds/2014-02-21_12-30-22/testng/testng-results-24.xml'
Processing '/x1/jenkins/jenkins-home/jobs/Apache-falcon/builds/2014-02-21_12-30-22/testng/testng-results-25.xml'
Processing '/x1/jenkins/jenkins-home/jobs/Apache-falcon/builds/2014-02-21_12-30-22/testng/testng-results-26.xml'
Processing '/x1/jenkins/jenkins-home/jobs/Apache-falcon/builds/2014-02-21_12-30-22/testng/testng-results-27.xml'
Processing '/x1/jenkins/jenkins-home/jobs/Apache-falcon/builds/2014-02-21_12-30-22/testng/testng-results-28.xml'
Processing '/x1/jenkins/jenkins-home/jobs/Apache-falcon/builds/2014-02-21_12-30-22/testng/testng-results-29.xml'
Processing '/x1/jenkins/jenkins-home/jobs/Apache-falcon/builds/2014-02-21_12-30-22/testng/testng-results-3.xml'
Processing '/x1/jenkins/jenkins-home/jobs/Apache-falcon/builds/2014-02-21_12-30-22/testng/testng-results-30.xml'
Processing '/x1/jenkins/jenkins-home/jobs/Apache-falcon/builds/2014-02-21_12-30-22/testng/testng-results-31.xml'
Processing '/x1/jenkins/jenkins-home/jobs/Apache-falcon/builds/2014-02-21_12-30-22/testng/testng-results-32.xml'
Processing '/x1/jenkins/jenkins-home/jobs/Apache-falcon/builds/2014-02-21_12-30-22/testng/testng-results-33.xml'
Processing '/x1/jenkins/jenkins-home/jobs/Apache-falcon/builds/2014-02-21_12-30-22/testng/testng-results-34.xml'
Processing '/x1/jenkins/jenkins-home/jobs/Apache-falcon/builds/2014-02-21_12-30-22/testng/testng-results-35.xml'
Processing '/x1/jenkins/jenkins-home/jobs/Apache-falcon/builds/2014-02-21_12-30-22/testng/testng-results-36.xml'
Processing '/x1/jenkins/jenkins-home/jobs/Apache-falcon/builds/2014-02-21_12-30-22/testng/testng-results-37.xml'
Processing '/x1/jenkins/jenkins-home/jobs/Apache-falcon/builds/2014-02-21_12-30-22/testng/testng-results-38.xml'
Processing '/x1/jenkins/jenkins-home/jobs/Apache-falcon/builds/2014-02-21_12-30-22/testng/testng-results-39.xml'
Processing '/x1/jenkins/jenkins-home/jobs/Apache-falcon/builds/2014-02-21_12-30-22/testng/testng-results-4.xml'
Processing '/x1/jenkins/jenkins-home/jobs/Apache-falcon/builds/2014-02-21_12-30-22/testng/testng-results-40.xml'
Processing '/x1/jenkins/jenkins-home/jobs/Apache-falcon/builds/2014-02-21_12-30-22/testng/testng-results-41.xml'
Processing '/x1/jenkins/jenkins-home/jobs/Apache-falcon/builds/2014-02-21_12-30-22/testng/testng-results-42.xml'
Processing '/x1/jenkins/jenkins-home/jobs/Apache-falcon/builds/2014-02-21_12-30-22/testng/testng-results-43.xml'
Processing '/x1/jenkins/jenkins-home/jobs/Apache-falcon/builds/2014-02-21_12-30-22/testng/testng-results-44.xml'
Processing '/x1/jenkins/jenkins-home/jobs/Apache-falcon/builds/2014-02-21_12-30-22/testng/testng-results-45.xml'
Processing '/x1/jenkins/jenkins-home/jobs/Apache-falcon/builds/2014-02-21_12-30-22/testng/testng-results-46.xml'
Processing '/x1/jenkins/jenkins-home/jobs/Apache-falcon/builds/2014-02-21_12-30-22/testng/testng-results-47.xml'
Processing '/x1/jenkins/jenkins-home/jobs/Apache-falcon/builds/2014-02-21_12-30-22/testng/testng-results-48.xml'
Processing '/x1/jenkins/jenkins-home/jobs/Apache-falcon/builds/2014-02-21_12-30-22/testng/testng-results-49.xml'
Processing '/x1/jenkins/jenkins-home/jobs/Apache-falcon/builds/2014-02-21_12-30-22/testng/testng-results-5.xml'
Processing '/x1/jenkins/jenkins-home/jobs/Apache-falcon/builds/2014-02-21_12-30-22/testng/testng-results-50.xml'
Processing '/x1/jenkins/jenkins-home/jobs/Apache-falcon/builds/2014-02-21_12-30-22/testng/testng-results-51.xml'
Processing '/x1/jenkins/jenkins-home/jobs/Apache-falcon/builds/2014-02-21_12-30-22/testng/testng-results-52.xml'
Processing '/x1/jenkins/jenkins-home/jobs/Apache-falcon/builds/2014-02-21_12-30-22/testng/testng-results-53.xml'
Processing '/x1/jenkins/jenkins-home/jobs/Apache-falcon/builds/2014-02-21_12-30-22/testng/testng-results-54.xml'
Processing '/x1/jenkins/jenkins-home/jobs/Apache-falcon/builds/2014-02-21_12-30-22/testng/testng-results-55.xml'
Processing '/x1/jenkins/jenkins-home/jobs/Apache-falcon/builds/2014-02-21_12-30-22/testng/testng-results-56.xml'
Processing '/x1/jenkins/jenkins-home/jobs/Apache-falcon/builds/2014-02-21_12-30-22/testng/testng-results-57.xml'
Processing '/x1/jenkins/jenkins-home/jobs/Apache-falcon/builds/2014-02-21_12-30-22/testng/testng-results-58.xml'
Processing '/x1/jenkins/jenkins-home/jobs/Apache-falcon/builds/2014-02-21_12-30-22/testng/testng-results-59.xml'
Processing '/x1/jenkins/jenkins-home/jobs/Apache-falcon/builds/2014-02-21_12-30-22/testng/testng-results-6.xml'
Processing '/x1/jenkins/jenkins-home/jobs/Apache-falcon/builds/2014-02-21_12-30-22/testng/testng-results-60.xml'
Processing '/x1/jenkins/jenkins-home/jobs/Apache-falcon/builds/2014-02-21_12-30-22/testng/testng-results-61.xml'
Processing '/x1/jenkins/jenkins-home/jobs/Apache-falcon/builds/2014-02-21_12-30-22/testng/testng-results-62.xml'
Processing '/x1/jenkins/jenkins-home/jobs/Apache-falcon/builds/2014-02-21_12-30-22/testng/testng-results-63.xml'
Processing '/x1/jenkins/jenkins-home/jobs/Apache-falcon/builds/2014-02-21_12-30-22/testng/testng-results-64.xml'
Processing '/x1/jenkins/jenkins-home/jobs/Apache-falcon/builds/2014-02-21_12-30-22/testng/testng-results-7.xml'
Processing '/x1/jenkins/jenkins-home/jobs/Apache-falcon/builds/2014-02-21_12-30-22/testng/testng-results-8.xml'
Processing '/x1/jenkins/jenkins-home/jobs/Apache-falcon/builds/2014-02-21_12-30-22/testng/testng-results-9.xml'
Processing '/x1/jenkins/jenkins-home/jobs/Apache-falcon/builds/2014-02-21_12-30-22/testng/testng-results.xml'
TestNG Reports Processing: FINISH

Mime
View raw message