falcon-dev mailing list archives

Site index · List index
Message view « Date » · « Thread »
Top « Date » · « Thread »
From Apache Jenkins Server <jenk...@builds.apache.org>
Subject Build failed in Jenkins: Apache-falcon #207
Date Fri, 21 Feb 2014 00:31:32 GMT
See <https://builds.apache.org/job/Apache-falcon/207/changes>

Changes:

[venkatesh] FALCON-311 Several dead links in Falcon documentation. Contributed by Suresh Srinivas

[venkatesh] FALCON-311 Updated the oozie link in the twiki to 4.0.0.

------------------------------------------
[...truncated 3129 lines...]
java.lang.AssertionError: expected:<200> but was:<400>
	at org.testng.Assert.fail(Assert.java:89)
	at org.testng.Assert.failNotEquals(Assert.java:489)
	at org.testng.Assert.assertEquals(Assert.java:118)
	at org.testng.Assert.assertEquals(Assert.java:365)
	at org.testng.Assert.assertEquals(Assert.java:375)
	at org.apache.falcon.resource.TestContext.assertSuccessful(TestContext.java:266)
	at org.apache.falcon.validation.ClusterEntityValidationIT.testClusterEntityWithValidInterfaces(ClusterEntityValidationIT.java:63)

Running org.apache.falcon.resource.EntityManagerJerseyIT
Tests run: 44, Failures: 2, Errors: 0, Skipped: 42, Time elapsed: 2.169 sec <<< FAILURE!
- in org.apache.falcon.resource.EntityManagerJerseyIT
testClusterSubmitScheduleSuspendResumeDelete(org.apache.falcon.resource.EntityManagerJerseyIT)
 Time elapsed: 0.589 sec  <<< FAILURE!
java.lang.AssertionError: expected:<200> but was:<400>
	at org.testng.Assert.fail(Assert.java:89)
	at org.testng.Assert.failNotEquals(Assert.java:489)
	at org.testng.Assert.assertEquals(Assert.java:118)
	at org.testng.Assert.assertEquals(Assert.java:365)
	at org.testng.Assert.assertEquals(Assert.java:375)
	at org.apache.falcon.resource.TestContext.assertSuccessful(TestContext.java:266)
	at org.apache.falcon.resource.EntityManagerJerseyIT.testClusterSubmitScheduleSuspendResumeDelete(EntityManagerJerseyIT.java:432)

cleanup(org.apache.falcon.resource.EntityManagerJerseyIT)  Time elapsed: 0.641 sec  <<<
FAILURE!
org.apache.oozie.client.OozieClientException: java.lang.reflect.UndeclaredThrowableException:
Unknown exception in doAs
	at org.apache.hadoop.security.authentication.client.AuthenticatedURL.extractToken(AuthenticatedURL.java:269)
	at org.apache.hadoop.security.authentication.client.PseudoAuthenticator.authenticate(PseudoAuthenticator.java:61)
	at org.apache.hadoop.security.authentication.client.KerberosAuthenticator.authenticate(KerberosAuthenticator.java:143)
	at org.apache.hadoop.security.authentication.client.AuthenticatedURL.openConnection(AuthenticatedURL.java:217)
	at org.apache.oozie.client.AuthOozieClient.createConnection(AuthOozieClient.java:128)
	at org.apache.oozie.client.ProxyOozieClient.access$001(ProxyOozieClient.java:48)
	at org.apache.oozie.client.ProxyOozieClient$1.run(ProxyOozieClient.java:89)
	at org.apache.oozie.client.ProxyOozieClient$1.run(ProxyOozieClient.java:87)
	at java.security.AccessController.doPrivileged(Native Method)
	at javax.security.auth.Subject.doAs(Subject.java:396)
	at org.apache.hadoop.security.UserGroupInformation.doAs(UserGroupInformation.java:1149)
	at org.apache.oozie.client.ProxyOozieClient.createConnection(ProxyOozieClient.java:87)
	at org.apache.oozie.client.OozieClient$ClientCallable.call(OozieClient.java:478)
	at org.apache.oozie.client.OozieClient.getBundleJobsInfo(OozieClient.java:1518)
	at org.apache.oozie.client.ProxyOozieClient.access$2901(ProxyOozieClient.java:48)
	at org.apache.oozie.client.ProxyOozieClient$29.call(ProxyOozieClient.java:555)
	at org.apache.oozie.client.ProxyOozieClient$29.call(ProxyOozieClient.java:553)
	at org.apache.oozie.client.OozieClient.doAs(OozieClient.java:191)
	at org.apache.oozie.client.ProxyOozieClient.getBundleJobsInfo(ProxyOozieClient.java:553)
	at org.apache.falcon.util.OozieTestUtils.getBundles(OozieTestUtils.java:64)
	at org.apache.falcon.util.OozieTestUtils.killOozieJobs(OozieTestUtils.java:73)
	at org.apache.falcon.resource.EntityManagerJerseyIT.cleanup(EntityManagerJerseyIT.java:187)

Running org.apache.falcon.resource.EntityManagerJerseySmokeIT
Tests run: 4, Failures: 2, Errors: 0, Skipped: 2, Time elapsed: 2.038 sec <<< FAILURE!
- in org.apache.falcon.resource.EntityManagerJerseySmokeIT
testFeedSchedule(org.apache.falcon.resource.EntityManagerJerseySmokeIT)  Time elapsed: 0.588
sec  <<< FAILURE!
java.lang.AssertionError: expected:<200> but was:<400>
	at org.testng.Assert.fail(Assert.java:89)
	at org.testng.Assert.failNotEquals(Assert.java:489)
	at org.testng.Assert.assertEquals(Assert.java:118)
	at org.testng.Assert.assertEquals(Assert.java:365)
	at org.testng.Assert.assertEquals(Assert.java:375)
	at org.apache.falcon.resource.TestContext.assertSuccessful(TestContext.java:266)
	at org.apache.falcon.resource.EntityManagerJerseySmokeIT.testFeedSchedule(EntityManagerJerseySmokeIT.java:110)

cleanup(org.apache.falcon.resource.EntityManagerJerseySmokeIT)  Time elapsed: 0.628 sec  <<<
FAILURE!
org.apache.oozie.client.OozieClientException: java.lang.reflect.UndeclaredThrowableException:
Unknown exception in doAs
	at org.apache.hadoop.security.authentication.client.AuthenticatedURL.extractToken(AuthenticatedURL.java:269)
	at org.apache.hadoop.security.authentication.client.PseudoAuthenticator.authenticate(PseudoAuthenticator.java:61)
	at org.apache.hadoop.security.authentication.client.KerberosAuthenticator.authenticate(KerberosAuthenticator.java:143)
	at org.apache.hadoop.security.authentication.client.AuthenticatedURL.openConnection(AuthenticatedURL.java:217)
	at org.apache.oozie.client.AuthOozieClient.createConnection(AuthOozieClient.java:128)
	at org.apache.oozie.client.ProxyOozieClient.access$001(ProxyOozieClient.java:48)
	at org.apache.oozie.client.ProxyOozieClient$1.run(ProxyOozieClient.java:89)
	at org.apache.oozie.client.ProxyOozieClient$1.run(ProxyOozieClient.java:87)
	at java.security.AccessController.doPrivileged(Native Method)
	at javax.security.auth.Subject.doAs(Subject.java:396)
	at org.apache.hadoop.security.UserGroupInformation.doAs(UserGroupInformation.java:1149)
	at org.apache.oozie.client.ProxyOozieClient.createConnection(ProxyOozieClient.java:87)
	at org.apache.oozie.client.OozieClient$ClientCallable.call(OozieClient.java:478)
	at org.apache.oozie.client.OozieClient.getBundleJobsInfo(OozieClient.java:1518)
	at org.apache.oozie.client.ProxyOozieClient.access$2901(ProxyOozieClient.java:48)
	at org.apache.oozie.client.ProxyOozieClient$29.call(ProxyOozieClient.java:555)
	at org.apache.oozie.client.ProxyOozieClient$29.call(ProxyOozieClient.java:553)
	at org.apache.oozie.client.OozieClient.doAs(OozieClient.java:191)
	at org.apache.oozie.client.ProxyOozieClient.getBundleJobsInfo(ProxyOozieClient.java:553)
	at org.apache.falcon.util.OozieTestUtils.getBundles(OozieTestUtils.java:64)
	at org.apache.falcon.util.OozieTestUtils.killOozieJobs(OozieTestUtils.java:73)
	at org.apache.falcon.resource.EntityManagerJerseySmokeIT.cleanup(EntityManagerJerseySmokeIT.java:61)

Running org.apache.falcon.resource.ProcessInstanceManagerIT
Tests run: 0, Failures: 0, Errors: 0, Skipped: 0, Time elapsed: 0.248 sec - in org.apache.falcon.resource.ProcessInstanceManagerIT
Running org.apache.falcon.late.LateDataHandlerIT
Tests run: 2, Failures: 0, Errors: 0, Skipped: 0, Time elapsed: 7.032 sec - in org.apache.falcon.late.LateDataHandlerIT

Results :

Failed tests: 
  FalconCLISmokeIT.testSubmitAndScheduleEntityValidCommands:55 expected:<-1> but was:<0>
  FalconCLIIT.testClientProperties:500->submitTestFiles:564 expected:<-1> but was:<0>
  FalconCLIIT.testContinue:447->submitTestFiles:564 expected:<-1> but was:<0>
  FalconCLIIT.testDefinitionEntityValidCommands:172->submitTestFiles:564 expected:<-1>
but was:<0>
  FalconCLIIT.testDeleteEntityValidCommands:292->submitTestFiles:564 expected:<-1>
but was:<0>
  FalconCLIIT.testInstanceGetLogs:531->submitTestFiles:564 expected:<-1> but was:<0>
  FalconCLIIT.testInstanceKillAndRerun:423->submitTestFiles:564 expected:<-1> but
was:<0>
  FalconCLIIT.testInstanceRunningAndStatusCommands:341->submitTestFiles:564 expected:<-1>
but was:<0>
  FalconCLIIT.testInstanceRunningAndSummaryCommands:370->submitTestFiles:564 expected:<-1>
but was:<0>
  FalconCLIIT.testInstanceSuspendAndResume:400->submitTestFiles:564 expected:<-1>
but was:<0>
  FalconCLIIT.testScheduleEntityValidCommands:198->submitTestFiles:564 expected:<-1>
but was:<0>
  FalconCLIIT.testSubmitAndScheduleEntityValidCommands:110 expected:<-1> but was:<0>
  FalconCLIIT.testSubmitEntityValidCommands:58 expected:<-1> but was:<0>
  FalconCLIIT.testSuspendResumeStatusEntityValidCommands:219->submitTestFiles:564 expected:<-1>
but was:<0>
  FalconCLIIT.testValidateValidCommands:138 expected:<-1> but was:<0>
  FeedEntityValidationIT.testFeedEntityWithInvalidTableUri:138 expected:<200> but was:<400>
  FeedEntityValidationIT.testFeedEntityWithInvalidTableUri:138 expected:<200> but was:<400>
  FeedEntityValidationIT.testFeedEntityWithInvalidTableUri:138 expected:<200> but was:<400>
  FeedEntityValidationIT.testFeedEntityWithInvalidTableUri:138 expected:<200> but was:<400>
  FeedEntityValidationIT.testFeedEntityWithInvalidTableUri:138 expected:<200> but was:<400>
  FeedEntityValidationIT.testFeedEntityWithInvalidTableUri:138 expected:<200> but was:<400>
  FeedEntityValidationIT.testFeedEntityWithValidTable:81 expected:<200> but was:<400>
  ClusterEntityValidationIT.testClusterEntityWithValidInterfaces:63 expected:<200> but
was:<400>
  EntityManagerJerseyIT.testClusterSubmitScheduleSuspendResumeDelete:432 expected:<200>
but was:<400>
  EntityManagerJerseyIT.cleanup:187 » OozieClient java.lang.reflect.UndeclaredTh...
  EntityManagerJerseySmokeIT.testFeedSchedule:110 expected:<200> but was:<400>
  EntityManagerJerseySmokeIT.cleanup:61 » OozieClient java.lang.reflect.Undeclar...

Tests run: 129, Failures: 27, Errors: 0, Skipped: 44

[INFO] 
[INFO] --- maven-jetty-plugin:6.1.26:stop (stop-jetty) @ falcon-webapp ---
[INFO] 
[INFO] --- maven-failsafe-plugin:2.16:verify (verify) @ falcon-webapp ---
[INFO] Stopping server 0
2014-02-21 00:31:15.905:INFO::Stopped SelectChannelConnector@0.0.0.0:41000
[INFO] Failsafe report directory: <https://builds.apache.org/job/Apache-falcon/ws/webapp/target/failsafe-reports>
[INFO] ------------------------------------------------------------------------
[INFO] Reactor Summary:
[INFO] 
[INFO] Checkstyle ........................................ SUCCESS [1.050s]
[INFO] Apache Falcon ..................................... SUCCESS [4.733s]
[INFO] Build Tools ....................................... SUCCESS [3.908s]
[INFO] Apache Falcon CLI client .......................... SUCCESS [27.356s]
[INFO] Apache Falcon Metrics ............................. SUCCESS [10.492s]
[INFO] Apache Falcon Hadoop Dependencies ................. SUCCESS [11.830s]
[INFO] Apache Falcon Test Utility ........................ SUCCESS [10.070s]
[INFO] Apache Falcon Commons ............................. SUCCESS [57.812s]
[INFO] Apache Falcon Oozie EL Extension .................. SUCCESS [14.515s]
[INFO] Apache Falcon Embedded Hadoop - Test Cluster ...... SUCCESS [27.674s]
[INFO] Apache Falcon Messaging ........................... SUCCESS [22.173s]
[INFO] Apache Falcon Oozie Adaptor ....................... SUCCESS [28.963s]
[INFO] Apache Falcon Feed ................................ SUCCESS [18.464s]
[INFO] Apache Falcon Process ............................. SUCCESS [23.852s]
[INFO] Apache Falcon Acquisition ......................... SUCCESS [0.584s]
[INFO] Apache Falcon Replication ......................... SUCCESS [16.129s]
[INFO] Apache Falcon Retention ........................... SUCCESS [18.648s]
[INFO] Apache Falcon Archival ............................ SUCCESS [0.569s]
[INFO] Apache Falcon Rerun ............................... SUCCESS [25.724s]
[INFO] Apache Falcon Prism ............................... SUCCESS [42.144s]
[INFO] Apache Falcon Web Application ..................... FAILURE [1:48.834s]
[INFO] Apache Falcon Documentation ....................... SKIPPED
[INFO] ------------------------------------------------------------------------
[INFO] BUILD FAILURE
[INFO] ------------------------------------------------------------------------
[INFO] Total time: 7:56.146s
[INFO] Finished at: Fri Feb 21 00:31:15 UTC 2014
[INFO] Final Memory: 313M/604M
[INFO] ------------------------------------------------------------------------
[ERROR] Failed to execute goal org.apache.maven.plugins:maven-failsafe-plugin:2.16:verify
(verify) on project falcon-webapp: There are test failures.
[ERROR] 
[ERROR] Please refer to <https://builds.apache.org/job/Apache-falcon/ws/webapp/target/failsafe-reports>
for the individual test results.
[ERROR] -> [Help 1]
[ERROR] 
[ERROR] To see the full stack trace of the errors, re-run Maven with the -e switch.
[ERROR] Re-run Maven using the -X switch to enable full debug logging.
[ERROR] 
[ERROR] For more information about the errors and possible solutions, please read the following
articles:
[ERROR] [Help 1] http://cwiki.apache.org/confluence/display/MAVEN/MojoFailureException
[ERROR] 
[ERROR] After correcting the problems, you can resume the build with the command
[ERROR]   mvn <goals> -rf :falcon-webapp
2014-02-21 00:31:17.301:INFO::Shutdown hook executing
Shutting down hive metastore.
2014-02-21 00:31:18.432:INFO::Shutdown hook complete
Build step 'Execute shell' marked build as failure
[CHECKSTYLE] Skipping publisher since build result is FAILURE
[FINDBUGS] Skipping publisher since build result is FAILURE
Archiving artifacts
TestNG Reports Processing: START
Looking for TestNG results report in workspace using pattern: **/target/surefire-reports/*.xml
Saving reports...
Processing '/x1/jenkins/jenkins-home/jobs/Apache-falcon/builds/2014-02-21_00-23-13/testng/testng-results-1.xml'
Processing '/x1/jenkins/jenkins-home/jobs/Apache-falcon/builds/2014-02-21_00-23-13/testng/testng-results-10.xml'
Processing '/x1/jenkins/jenkins-home/jobs/Apache-falcon/builds/2014-02-21_00-23-13/testng/testng-results-11.xml'
Processing '/x1/jenkins/jenkins-home/jobs/Apache-falcon/builds/2014-02-21_00-23-13/testng/testng-results-12.xml'
Processing '/x1/jenkins/jenkins-home/jobs/Apache-falcon/builds/2014-02-21_00-23-13/testng/testng-results-13.xml'
Processing '/x1/jenkins/jenkins-home/jobs/Apache-falcon/builds/2014-02-21_00-23-13/testng/testng-results-14.xml'
Processing '/x1/jenkins/jenkins-home/jobs/Apache-falcon/builds/2014-02-21_00-23-13/testng/testng-results-15.xml'
Processing '/x1/jenkins/jenkins-home/jobs/Apache-falcon/builds/2014-02-21_00-23-13/testng/testng-results-16.xml'
Processing '/x1/jenkins/jenkins-home/jobs/Apache-falcon/builds/2014-02-21_00-23-13/testng/testng-results-17.xml'
Processing '/x1/jenkins/jenkins-home/jobs/Apache-falcon/builds/2014-02-21_00-23-13/testng/testng-results-18.xml'
Processing '/x1/jenkins/jenkins-home/jobs/Apache-falcon/builds/2014-02-21_00-23-13/testng/testng-results-19.xml'
Processing '/x1/jenkins/jenkins-home/jobs/Apache-falcon/builds/2014-02-21_00-23-13/testng/testng-results-2.xml'
Processing '/x1/jenkins/jenkins-home/jobs/Apache-falcon/builds/2014-02-21_00-23-13/testng/testng-results-20.xml'
Processing '/x1/jenkins/jenkins-home/jobs/Apache-falcon/builds/2014-02-21_00-23-13/testng/testng-results-21.xml'
Processing '/x1/jenkins/jenkins-home/jobs/Apache-falcon/builds/2014-02-21_00-23-13/testng/testng-results-22.xml'
Processing '/x1/jenkins/jenkins-home/jobs/Apache-falcon/builds/2014-02-21_00-23-13/testng/testng-results-23.xml'
Processing '/x1/jenkins/jenkins-home/jobs/Apache-falcon/builds/2014-02-21_00-23-13/testng/testng-results-24.xml'
Processing '/x1/jenkins/jenkins-home/jobs/Apache-falcon/builds/2014-02-21_00-23-13/testng/testng-results-25.xml'
Processing '/x1/jenkins/jenkins-home/jobs/Apache-falcon/builds/2014-02-21_00-23-13/testng/testng-results-26.xml'
Processing '/x1/jenkins/jenkins-home/jobs/Apache-falcon/builds/2014-02-21_00-23-13/testng/testng-results-27.xml'
Processing '/x1/jenkins/jenkins-home/jobs/Apache-falcon/builds/2014-02-21_00-23-13/testng/testng-results-28.xml'
Processing '/x1/jenkins/jenkins-home/jobs/Apache-falcon/builds/2014-02-21_00-23-13/testng/testng-results-29.xml'
Processing '/x1/jenkins/jenkins-home/jobs/Apache-falcon/builds/2014-02-21_00-23-13/testng/testng-results-3.xml'
Processing '/x1/jenkins/jenkins-home/jobs/Apache-falcon/builds/2014-02-21_00-23-13/testng/testng-results-30.xml'
Processing '/x1/jenkins/jenkins-home/jobs/Apache-falcon/builds/2014-02-21_00-23-13/testng/testng-results-31.xml'
Processing '/x1/jenkins/jenkins-home/jobs/Apache-falcon/builds/2014-02-21_00-23-13/testng/testng-results-32.xml'
Processing '/x1/jenkins/jenkins-home/jobs/Apache-falcon/builds/2014-02-21_00-23-13/testng/testng-results-33.xml'
Processing '/x1/jenkins/jenkins-home/jobs/Apache-falcon/builds/2014-02-21_00-23-13/testng/testng-results-34.xml'
Processing '/x1/jenkins/jenkins-home/jobs/Apache-falcon/builds/2014-02-21_00-23-13/testng/testng-results-35.xml'
Processing '/x1/jenkins/jenkins-home/jobs/Apache-falcon/builds/2014-02-21_00-23-13/testng/testng-results-36.xml'
Processing '/x1/jenkins/jenkins-home/jobs/Apache-falcon/builds/2014-02-21_00-23-13/testng/testng-results-37.xml'
Processing '/x1/jenkins/jenkins-home/jobs/Apache-falcon/builds/2014-02-21_00-23-13/testng/testng-results-38.xml'
Processing '/x1/jenkins/jenkins-home/jobs/Apache-falcon/builds/2014-02-21_00-23-13/testng/testng-results-39.xml'
Processing '/x1/jenkins/jenkins-home/jobs/Apache-falcon/builds/2014-02-21_00-23-13/testng/testng-results-4.xml'
Processing '/x1/jenkins/jenkins-home/jobs/Apache-falcon/builds/2014-02-21_00-23-13/testng/testng-results-40.xml'
Processing '/x1/jenkins/jenkins-home/jobs/Apache-falcon/builds/2014-02-21_00-23-13/testng/testng-results-41.xml'
Processing '/x1/jenkins/jenkins-home/jobs/Apache-falcon/builds/2014-02-21_00-23-13/testng/testng-results-42.xml'
Processing '/x1/jenkins/jenkins-home/jobs/Apache-falcon/builds/2014-02-21_00-23-13/testng/testng-results-43.xml'
Processing '/x1/jenkins/jenkins-home/jobs/Apache-falcon/builds/2014-02-21_00-23-13/testng/testng-results-44.xml'
Processing '/x1/jenkins/jenkins-home/jobs/Apache-falcon/builds/2014-02-21_00-23-13/testng/testng-results-45.xml'
Processing '/x1/jenkins/jenkins-home/jobs/Apache-falcon/builds/2014-02-21_00-23-13/testng/testng-results-46.xml'
Processing '/x1/jenkins/jenkins-home/jobs/Apache-falcon/builds/2014-02-21_00-23-13/testng/testng-results-47.xml'
Processing '/x1/jenkins/jenkins-home/jobs/Apache-falcon/builds/2014-02-21_00-23-13/testng/testng-results-48.xml'
Processing '/x1/jenkins/jenkins-home/jobs/Apache-falcon/builds/2014-02-21_00-23-13/testng/testng-results-49.xml'
Processing '/x1/jenkins/jenkins-home/jobs/Apache-falcon/builds/2014-02-21_00-23-13/testng/testng-results-5.xml'
Processing '/x1/jenkins/jenkins-home/jobs/Apache-falcon/builds/2014-02-21_00-23-13/testng/testng-results-50.xml'
Processing '/x1/jenkins/jenkins-home/jobs/Apache-falcon/builds/2014-02-21_00-23-13/testng/testng-results-51.xml'
Processing '/x1/jenkins/jenkins-home/jobs/Apache-falcon/builds/2014-02-21_00-23-13/testng/testng-results-52.xml'
Processing '/x1/jenkins/jenkins-home/jobs/Apache-falcon/builds/2014-02-21_00-23-13/testng/testng-results-53.xml'
Processing '/x1/jenkins/jenkins-home/jobs/Apache-falcon/builds/2014-02-21_00-23-13/testng/testng-results-54.xml'
Processing '/x1/jenkins/jenkins-home/jobs/Apache-falcon/builds/2014-02-21_00-23-13/testng/testng-results-55.xml'
Processing '/x1/jenkins/jenkins-home/jobs/Apache-falcon/builds/2014-02-21_00-23-13/testng/testng-results-56.xml'
Processing '/x1/jenkins/jenkins-home/jobs/Apache-falcon/builds/2014-02-21_00-23-13/testng/testng-results-57.xml'
Processing '/x1/jenkins/jenkins-home/jobs/Apache-falcon/builds/2014-02-21_00-23-13/testng/testng-results-58.xml'
Processing '/x1/jenkins/jenkins-home/jobs/Apache-falcon/builds/2014-02-21_00-23-13/testng/testng-results-59.xml'
Processing '/x1/jenkins/jenkins-home/jobs/Apache-falcon/builds/2014-02-21_00-23-13/testng/testng-results-6.xml'
Processing '/x1/jenkins/jenkins-home/jobs/Apache-falcon/builds/2014-02-21_00-23-13/testng/testng-results-60.xml'
Processing '/x1/jenkins/jenkins-home/jobs/Apache-falcon/builds/2014-02-21_00-23-13/testng/testng-results-61.xml'
Processing '/x1/jenkins/jenkins-home/jobs/Apache-falcon/builds/2014-02-21_00-23-13/testng/testng-results-62.xml'
Processing '/x1/jenkins/jenkins-home/jobs/Apache-falcon/builds/2014-02-21_00-23-13/testng/testng-results-63.xml'
Processing '/x1/jenkins/jenkins-home/jobs/Apache-falcon/builds/2014-02-21_00-23-13/testng/testng-results-64.xml'
Processing '/x1/jenkins/jenkins-home/jobs/Apache-falcon/builds/2014-02-21_00-23-13/testng/testng-results-7.xml'
Processing '/x1/jenkins/jenkins-home/jobs/Apache-falcon/builds/2014-02-21_00-23-13/testng/testng-results-8.xml'
Processing '/x1/jenkins/jenkins-home/jobs/Apache-falcon/builds/2014-02-21_00-23-13/testng/testng-results-9.xml'
Processing '/x1/jenkins/jenkins-home/jobs/Apache-falcon/builds/2014-02-21_00-23-13/testng/testng-results.xml'
TestNG Reports Processing: FINISH

Mime
View raw message