falcon-dev mailing list archives

Site index · List index
Message view « Date » · « Thread »
Top « Date » · « Thread »
From Jean-Baptiste Onofré (JIRA) <j...@apache.org>
Subject [jira] [Created] (FALCON-275) Messaging tests fail
Date Thu, 23 Jan 2014 14:28:37 GMT
Jean-Baptiste Onofré created FALCON-275:
-------------------------------------------

             Summary: Messaging tests fail
                 Key: FALCON-275
                 URL: https://issues.apache.org/jira/browse/FALCON-275
             Project: Falcon
          Issue Type: Test
          Components: messaging, tests
            Reporter: Jean-Baptiste Onofré
            Assignee: Jean-Baptiste Onofré


On master, the messaging FeedProducerTest fails:

Tests run: 2, Failures: 1, Errors: 0, Skipped: 0, Time elapsed: 3.153 sec <<< FAILURE!
- in org.apache.falcon.messaging.FeedProducerTest
testLogFile(org.apache.falcon.messaging.FeedProducerTest)  Time elapsed: 0.326 sec  <<<
FAILURE!
java.lang.AssertionError: expected:</falcon/feed/agg-logs/path1/2010/10/10/20> but was:</falcon/feed/agg-logs/path1/2010/10/10/21>



--
This message was sent by Atlassian JIRA
(v6.1.5#6160)

Mime
View raw message