falcon-dev mailing list archives

Site index · List index
Message view « Date » · « Thread »
Top « Date » · « Thread »
From Apache Jenkins Server <jenk...@builds.apache.org>
Subject Build failed in Jenkins: Apache-falcon #58
Date Tue, 08 Oct 2013 20:16:31 GMT
See <https://builds.apache.org/job/Apache-falcon/58/>

------------------------------------------
[...truncated 5664 lines...]
[INFO] [INFO] --- maven-jar-plugin:2.3.1:jar (default-jar) @ oozie-mini ---
[INFO] [WARNING] JAR will be empty - no content was marked for inclusion!
[INFO] [INFO] Building jar: <https://builds.apache.org/job/Apache-falcon/ws/target/oozie-4.0.0/minitest/target/oozie-mini-4.0.0-falcon.jar>
[INFO] [INFO] 
[INFO] [INFO] --- maven-checkstyle-plugin:2.9.1:check (default) @ oozie-mini ---
[INFO] [INFO] Starting audit...
[INFO] Audit done.
[INFO] 
[INFO] [INFO] 
[INFO] [INFO] --- maven-install-plugin:2.3.1:install (default-install) @ oozie-mini ---
[INFO] [INFO] Installing <https://builds.apache.org/job/Apache-falcon/ws/target/oozie-4.0.0/minitest/target/oozie-mini-4.0.0-falcon.jar>
to /home/jenkins/.m2/repository/org/apache/oozie/test/oozie-mini/4.0.0-falcon/oozie-mini-4.0.0-falcon.jar
[INFO] [INFO] Installing <https://builds.apache.org/job/Apache-falcon/ws/target/oozie-4.0.0/minitest/pom.xml>
to /home/jenkins/.m2/repository/org/apache/oozie/test/oozie-mini/4.0.0-falcon/oozie-mini-4.0.0-falcon.pom
[INFO] [INFO]                                                                         
[INFO] [INFO] ------------------------------------------------------------------------
[INFO] [INFO] Building Apache Oozie Distro 4.0.0-falcon
[INFO] [INFO] ------------------------------------------------------------------------
[INFO] [INFO] 
[INFO] [INFO] --- maven-clean-plugin:2.4.1:clean (default-clean) @ oozie-distro ---
[INFO] [INFO] 
[INFO] [INFO] --- maven-resources-plugin:2.5:resources (default-resources) @ oozie-distro
---
[INFO] [debug] execute contextualize
[INFO] [INFO] Using 'UTF-8' encoding to copy filtered resources.
[INFO] [INFO] Copying 0 resource
[INFO] [INFO] 
[INFO] [INFO] --- maven-compiler-plugin:2.3.2:compile (default-compile) @ oozie-distro ---
[INFO] [INFO] No sources to compile
[INFO] [INFO] 
[INFO] [INFO] --- maven-resources-plugin:2.5:testResources (default-testResources) @ oozie-distro
---
[INFO] [debug] execute contextualize
[INFO] [INFO] Using 'UTF-8' encoding to copy filtered resources.
[INFO] [INFO] skip non existing resourceDirectory <https://builds.apache.org/job/Apache-falcon/ws/target/oozie-4.0.0/distro/src/test/resources>
[INFO] [INFO] 
[INFO] [INFO] --- maven-compiler-plugin:2.3.2:testCompile (default-testCompile) @ oozie-distro
---
[INFO] [INFO] No sources to compile
[INFO] [INFO] 
[INFO] [INFO] --- maven-surefire-plugin:2.12:test (default-test) @ oozie-distro ---
[INFO] [INFO] Tests are skipped.
[INFO] [INFO] 
[INFO] [INFO] --- maven-jar-plugin:2.3.1:jar (default-jar) @ oozie-distro ---
[INFO] [INFO] Building jar: <https://builds.apache.org/job/Apache-falcon/ws/target/oozie-4.0.0/distro/target/oozie-distro-4.0.0-falcon.jar>
[INFO] [INFO] 
[INFO] [INFO] --- maven-antrun-plugin:1.6:run (default) @ oozie-distro ---
[INFO] [INFO] Executing tasks
[INFO] 
[INFO] main:
[INFO]     [mkdir] Created dir: <https://builds.apache.org/job/Apache-falcon/ws/target/oozie-4.0.0/distro/downloads>
[INFO]       [get] Getting: http://archive.apache.org/dist/tomcat/tomcat-6/v6.0.36/bin/apache-tomcat-6.0.36.tar.gz
[INFO]       [get] To: <https://builds.apache.org/job/Apache-falcon/ws/target/oozie-4.0.0/distro/downloads/tomcat.tar.gz>
[INFO] ..........................................................................................................................................................................
[INFO]     [mkdir] Created dir: <https://builds.apache.org/job/Apache-falcon/ws/target/oozie-4.0.0/distro/target/tomcat>
[INFO]    [gunzip] Expanding <https://builds.apache.org/job/Apache-falcon/ws/target/oozie-4.0.0/distro/downloads/tomcat.tar.gz>
to <https://builds.apache.org/job/Apache-falcon/ws/target/oozie-4.0.0/distro/target/tomcat/tomcat.tar>
[INFO]     [untar] Expanding: <https://builds.apache.org/job/Apache-falcon/ws/target/oozie-4.0.0/distro/target/tomcat/tomcat.tar>
into <https://builds.apache.org/job/Apache-falcon/ws/target/oozie-4.0.0/distro/target/tomcat>
[INFO]    [delete] Deleting directory <https://builds.apache.org/job/Apache-falcon/ws/target/oozie-4.0.0/distro/target/tomcat/oozie-server/webapps>
[INFO]     [mkdir] Created dir: <https://builds.apache.org/job/Apache-falcon/ws/target/oozie-4.0.0/distro/target/tomcat/oozie-server/webapps>
[INFO]    [delete] Deleting: <https://builds.apache.org/job/Apache-falcon/ws/target/oozie-4.0.0/distro/target/tomcat/oozie-server/conf/server.xml>
[INFO]      [copy] Copying 1 file to <https://builds.apache.org/job/Apache-falcon/ws/target/oozie-4.0.0/distro/target/tomcat/oozie-server/conf>
[INFO]      [copy] Copying 1 file to <https://builds.apache.org/job/Apache-falcon/ws/target/oozie-4.0.0/distro/target/tomcat/oozie-server/conf>
[INFO]     [mkdir] Created dir: <https://builds.apache.org/job/Apache-falcon/ws/target/oozie-4.0.0/distro/target/tomcat/oozie-server/conf/ssl>
[INFO]      [copy] Copying 1 file to <https://builds.apache.org/job/Apache-falcon/ws/target/oozie-4.0.0/distro/target/tomcat/oozie-server/conf/ssl>
[INFO]      [copy] Copying 1 file to <https://builds.apache.org/job/Apache-falcon/ws/target/oozie-4.0.0/distro/target/tomcat/oozie-server/conf/ssl>
[INFO]      [copy] Copying 1 file to <https://builds.apache.org/job/Apache-falcon/ws/target/oozie-4.0.0/distro/target/tomcat/oozie-server/conf/ssl>
[INFO]      [copy] Copying 3 files to <https://builds.apache.org/job/Apache-falcon/ws/target/oozie-4.0.0/distro/target/tomcat/oozie-server/webapps/ROOT>
[INFO] [INFO] Executed tasks
[INFO] [INFO] 
[INFO] [INFO] --- maven-checkstyle-plugin:2.9.1:check (default) @ oozie-distro ---
[INFO] [INFO] Starting audit...
[INFO] Audit done.
[INFO] 
[INFO] [INFO] 
[INFO] [INFO] --- maven-install-plugin:2.3.1:install (default-install) @ oozie-distro ---
[INFO] [INFO] Installing <https://builds.apache.org/job/Apache-falcon/ws/target/oozie-4.0.0/distro/target/oozie-distro-4.0.0-falcon.jar>
to /home/jenkins/.m2/repository/org/apache/oozie/oozie-distro/4.0.0-falcon/oozie-distro-4.0.0-falcon.jar
[INFO] [INFO] Installing <https://builds.apache.org/job/Apache-falcon/ws/target/oozie-4.0.0/distro/pom.xml>
to /home/jenkins/.m2/repository/org/apache/oozie/oozie-distro/4.0.0-falcon/oozie-distro-4.0.0-falcon.pom
[INFO] [INFO] ------------------------------------------------------------------------
[INFO] [INFO] Reactor Summary:
[INFO] [INFO] 
[INFO] [INFO] Apache Oozie Main ................................. SUCCESS [2.794s]
[INFO] [INFO] Apache Oozie Client ............................... SUCCESS [4.225s]
[INFO] [INFO] Apache Oozie Hadoop 1.1.1.oozie-4.0.0-falcon ...... SUCCESS [0.129s]
[INFO] [INFO] Apache Oozie Hadoop Distcp 1.1.1.oozie-4.0.0-falcon  SUCCESS [0.091s]
[INFO] [INFO] Apache Oozie Hadoop 1.1.1.oozie-4.0.0-falcon Test . SUCCESS [0.190s]
[INFO] [INFO] Apache Oozie Hadoop 2.2.0-SNAPSHOT.oozie-4.0.0-falcon  SUCCESS [6.777s]
[INFO] [INFO] Apache Oozie Hadoop 2.2.0-SNAPSHOT.oozie-4.0.0-falcon Test  SUCCESS [1.709s]
[INFO] [INFO] Apache Oozie Hadoop Distcp 2.2.0-SNAPSHOT.oozie-4.0.0-falcon  SUCCESS [0.401s]
[INFO] [INFO] Apache Oozie Hadoop 0.23.5.oozie-4.0.0-falcon ..... SUCCESS [0.228s]
[INFO] [INFO] Apache Oozie Hadoop 0.23.5.oozie-4.0.0-falcon Test  SUCCESS [0.226s]
[INFO] [INFO] Apache Oozie Hadoop Distcp 0.23.5.oozie-4.0.0-falcon  SUCCESS [0.083s]
[INFO] [INFO] Apache Oozie Hadoop Libs .......................... SUCCESS [0.042s]
[INFO] [INFO] Apache Oozie Hbase 0.94.2.oozie-4.0.0-falcon ...... SUCCESS [0.089s]
[INFO] [INFO] Apache Oozie Hbase Libs ........................... SUCCESS [0.041s]
[INFO] [INFO] Apache Oozie HCatalog 0.5.0.oozie-4.0.0-falcon .... SUCCESS [3.146s]
[INFO] [INFO] Apache Oozie HCatalog 0.6.0.oozie-4.0.0-falcon .... SUCCESS [2.109s]
[INFO] [INFO] Apache Oozie HCatalog Libs ........................ SUCCESS [0.041s]
[INFO] [INFO] Apache Oozie Share Lib Oozie ...................... SUCCESS [1.555s]
[INFO] [INFO] Apache Oozie Share Lib HCatalog ................... SUCCESS [1.651s]
[INFO] [INFO] Apache Oozie Core ................................. SUCCESS [21.289s]
[INFO] [INFO] Apache Oozie Docs ................................. SUCCESS [1.336s]
[INFO] [INFO] Apache Oozie Share Lib Pig ........................ SUCCESS [2.183s]
[INFO] [INFO] Apache Oozie Share Lib Hive ....................... SUCCESS [1.834s]
[INFO] [INFO] Apache Oozie Share Lib Sqoop ...................... SUCCESS [1.654s]
[INFO] [INFO] Apache Oozie Share Lib Streaming .................. SUCCESS [2.460s]
[INFO] [INFO] Apache Oozie Share Lib Distcp ..................... SUCCESS [0.933s]
[INFO] [INFO] Apache Oozie WebApp ............................... SUCCESS [2.539s]
[INFO] [INFO] Apache Oozie Examples ............................. SUCCESS [1.452s]
[INFO] [INFO] Apache Oozie Share Lib ............................ SUCCESS [0.042s]
[INFO] [INFO] Apache Oozie Tools ................................ SUCCESS [2.417s]
[INFO] [INFO] Apache Oozie MiniOozie ............................ SUCCESS [0.795s]
[INFO] [INFO] Apache Oozie Distro ............................... SUCCESS [3.433s]
[INFO] [INFO] ------------------------------------------------------------------------
[INFO] [INFO] BUILD SUCCESS
[INFO] [INFO] ------------------------------------------------------------------------
[INFO] [INFO] Total time: 1:08.604s
[INFO] [INFO] Finished at: Tue Oct 08 20:16:26 UTC 2013
[INFO] [INFO] Final Memory: 184M/471M
[INFO] [INFO] ------------------------------------------------------------------------
[INFO] ~/jenkins-slave/workspace/Apache-falcon/build-tools
[INFO] 
[INFO] --- maven-resources-plugin:2.4.3:resources (default-resources) @ build-tools ---
[WARNING] Using platform encoding (ISO-8859-1 actually) to copy filtered resources, i.e. build
is platform dependent!
[INFO] Copying 4 resources
[INFO] 
[INFO] --- maven-compiler-plugin:2.3.2:compile (default-compile) @ build-tools ---
[INFO] No sources to compile
[INFO] 
[INFO] --- maven-resources-plugin:2.4.3:testResources (default-testResources) @ build-tools
---
[WARNING] Using platform encoding (ISO-8859-1 actually) to copy filtered resources, i.e. build
is platform dependent!
[INFO] skip non existing resourceDirectory <https://builds.apache.org/job/Apache-falcon/ws/build-tools/src/test/resources>
[INFO] 
[INFO] --- maven-compiler-plugin:2.3.2:testCompile (default-testCompile) @ build-tools ---
[INFO] No sources to compile
[INFO] 
[INFO] --- maven-surefire-plugin:2.7.2:test (default-test) @ build-tools ---
[INFO] No tests to run.
[INFO] Surefire report directory: <https://builds.apache.org/job/Apache-falcon/ws/build-tools/target/surefire-reports>

-------------------------------------------------------
 T E S T S
-------------------------------------------------------
There are no tests to run.

Results :

Tests run: 0, Failures: 0, Errors: 0, Skipped: 0

[INFO] 
[INFO] --- maven-jar-plugin:2.3.1:jar (default-jar) @ build-tools ---
[INFO] Building jar: <https://builds.apache.org/job/Apache-falcon/ws/build-tools/target/build-tools-0.4-incubating-SNAPSHOT.jar>
[INFO]                                                                         
[INFO] ------------------------------------------------------------------------
[INFO] Building Apache Falcon 0.4-incubating-SNAPSHOT
[INFO] ------------------------------------------------------------------------
[INFO] 
[INFO] --- maven-clean-plugin:2.4.1:clean (default-clean) @ falcon-main ---
[INFO] Deleting <https://builds.apache.org/job/Apache-falcon/ws/target>
[INFO] 
[INFO] --- buildnumber-maven-plugin:1.0:create (default) @ falcon-main ---
[INFO] Checking for local modifications: skipped.
[INFO] Updating project files from SCM: skipped.
[INFO] Executing: /bin/sh -c cd <https://builds.apache.org/job/Apache-falcon/ws/> &&
git show
[INFO] Working directory: <https://builds.apache.org/job/Apache-falcon/ws/>
[INFO] Storing buildNumber: acde28c3c8a0c4e244cb9de96a7f6f05b5f29e3c at timestamp: 1381263388814
[INFO] Executing: /bin/sh -c cd <https://builds.apache.org/job/Apache-falcon/ws/> &&
git show
[INFO] Working directory: <https://builds.apache.org/job/Apache-falcon/ws/>
[INFO] Storing buildScmBranch: UNKNOWN
[INFO] 
[INFO] --- maven-site-plugin:3.2:site (default) @ falcon-main ---
[INFO] maven.site.skip = true: Skipping site generation
[INFO] 
[INFO] --- maven-source-plugin:2.2.1:jar-no-fork (attach-sources) @ falcon-main ---
[INFO] 
[INFO] >>> maven-javadoc-plugin:2.8.1:javadoc (attach-javadocs) @ falcon-main >>>
[INFO] 
[INFO] --- buildnumber-maven-plugin:1.0:create (default) @ falcon-main ---
[INFO] Checking for local modifications: skipped.
[INFO] Updating project files from SCM: skipped.
[INFO] Executing: /bin/sh -c cd <https://builds.apache.org/job/Apache-falcon/ws/> &&
git show
[INFO] Working directory: <https://builds.apache.org/job/Apache-falcon/ws/>
[INFO] Storing buildNumber: acde28c3c8a0c4e244cb9de96a7f6f05b5f29e3c at timestamp: 1381263389634
[INFO] Executing: /bin/sh -c cd <https://builds.apache.org/job/Apache-falcon/ws/> &&
git show
[INFO] Working directory: <https://builds.apache.org/job/Apache-falcon/ws/>
[INFO] Storing buildScmBranch: UNKNOWN
[INFO] 
[INFO] <<< maven-javadoc-plugin:2.8.1:javadoc (attach-javadocs) @ falcon-main <<<
[INFO] 
[INFO] --- maven-javadoc-plugin:2.8.1:javadoc (attach-javadocs) @ falcon-main ---
[INFO] 
[INFO] --- maven-javadoc-plugin:2.8.1:jar (attach-javadocs) @ falcon-main ---
[INFO] Not executing Javadoc as the project is not a Java classpath-capable package
[INFO] 
[INFO] --- apache-rat-plugin:0.7:check (rat-check) @ falcon-main ---
[INFO] Exclude: *.txt
[INFO] Exclude: .git/**
[INFO] Exclude: .idea/**
[INFO] Exclude: **/*.twiki
[INFO] Exclude: **/*.iml
[INFO] Exclude: **/target/**
[INFO] Exclude: **/activemq-data/**
[INFO] Exclude: **/build/**
[INFO] Exclude: *.patch
[INFO] Exclude: derby.log
[INFO] Exclude: **/logs/**
[INFO] Exclude: **/.classpath
[INFO] Exclude: **/.project
[INFO] Exclude: **/.settings/**
[INFO] Exclude: **/test-output/**
[INFO] Exclude: **/data.txt
[INFO] Exclude: **/maven-eclipse.xml
[INFO] Exclude: **/.externalToolBuilders/**
[INFO] ------------------------------------------------------------------------
[INFO] Reactor Summary:
[INFO] 
[INFO] Build Tools ....................................... SUCCESS [1:13.238s]
[INFO] Apache Falcon ..................................... FAILURE [2.788s]
[INFO] Apache Falcon CLI client .......................... SKIPPED
[INFO] Apache Falcon Metrics ............................. SKIPPED
[INFO] Apache Falcon Test Utility ........................ SKIPPED
[INFO] Apache Falcon Commons ............................. SKIPPED
[INFO] Apache Falcon Hadoop Dependencies ................. SKIPPED
[INFO] Apache Falcon Oozie EL Extension .................. SKIPPED
[INFO] Apache Falcon Embedded Hadoop - Test Cluster ...... SKIPPED
[INFO] Apache Falcon Messaging ........................... SKIPPED
[INFO] Apache Falcon Oozie Adaptor ....................... SKIPPED
[INFO] Apache Falcon Feed ................................ SKIPPED
[INFO] Apache Falcon Process ............................. SKIPPED
[INFO] Apache Falcon Acquisition ......................... SKIPPED
[INFO] Apache Falcon Replication ......................... SKIPPED
[INFO] Apache Falcon Retention ........................... SKIPPED
[INFO] Apache Falcon Archival ............................ SKIPPED
[INFO] Apache Falcon Rerun ............................... SKIPPED
[INFO] Apache Falcon Prism ............................... SKIPPED
[INFO] Apache Falcon Web Application ..................... SKIPPED
[INFO] Apache Falcon Documentation ....................... SKIPPED
[INFO] ------------------------------------------------------------------------
[INFO] BUILD FAILURE
[INFO] ------------------------------------------------------------------------
[INFO] Total time: 1:16.519s
[INFO] Finished at: Tue Oct 08 20:16:31 UTC 2013
[INFO] Final Memory: 22M/257M
[INFO] ------------------------------------------------------------------------
[ERROR] Failed to execute goal org.apache.rat:apache-rat-plugin:0.7:check (rat-check) on project
falcon-main: Too many unapproved licenses: 10 -> [Help 1]
[ERROR] 
[ERROR] To see the full stack trace of the errors, re-run Maven with the -e switch.
[ERROR] Re-run Maven using the -X switch to enable full debug logging.
[ERROR] 
[ERROR] For more information about the errors and possible solutions, please read the following
articles:
[ERROR] [Help 1] http://cwiki.apache.org/confluence/display/MAVEN/MojoFailureException
[ERROR] 
[ERROR] After correcting the problems, you can resume the build with the command
[ERROR]   mvn <goals> -rf :falcon-main
Build step 'Execute shell' marked build as failure

Mime
View raw message