falcon-dev mailing list archives

Site index · List index
Message view « Date » · « Thread »
Top « Date » · « Thread »
From Seetharam Venkatesh <venkat...@innerzeal.com>
Subject Re: Build failed in Jenkins: Apache-falcon #29
Date Wed, 14 Aug 2013 17:27:42 GMT
I'll get to it early next week. Sorry about that.


On Tue, Aug 13, 2013 at 11:02 PM, Shwetha GS <shwetha.gs@inmobi.com> wrote:

> [INFO] src/bin/OOZIE-674.sh: line 33: mvn: command not found
>
>
> Can we get this fixed?
>
>
>
> On Wed, Aug 14, 2013 at 5:59 AM, Apache Jenkins Server <
> jenkins@builds.apache.org> wrote:
>
> > See <https://builds.apache.org/job/Apache-falcon/29/>
> >
> > ------------------------------------------
> > [...truncated 5430 lines...]
> > [INFO]
> > [INFO] --- maven-resources-plugin:2.4.3:resources (default-resources) @
> > falcon-oozie-el-extension ---
> > [INFO] Using 'UTF-8' encoding to copy filtered resources.
> > [INFO] skip non existing resourceDirectory <
> >
> https://builds.apache.org/job/Apache-falcon/ws/oozie-el-extensions/src/main/resources
> > >
> > [INFO] skip non existing resourceDirectory <
> >
> https://builds.apache.org/job/Apache-falcon/ws/oozie-el-extensions/src/main/resources
> > >
> > [INFO] Copying 2 resources to META-INF
> > [INFO]
> > [INFO] --- maven-compiler-plugin:2.3.2:compile (default-compile) @
> > falcon-oozie-el-extension ---
> > [INFO] Nothing to compile - all classes are up to date
> > [INFO]
> > [INFO] --- maven-resources-plugin:2.4.3:testResources
> > (default-testResources) @ falcon-oozie-el-extension ---
> > [INFO] Using 'UTF-8' encoding to copy filtered resources.
> > [INFO] Copying 1 resource
> > [INFO]
> > [INFO] --- maven-compiler-plugin:2.3.2:testCompile (default-testCompile)
> @
> > falcon-oozie-el-extension ---
> > [INFO] Nothing to compile - all classes are up to date
> > [INFO]
> > [INFO] --- maven-surefire-plugin:2.14:test (default-test) @
> > falcon-oozie-el-extension ---
> > [WARNING] The parameter forkMode is deprecated since version 2.14. Use
> > forkCount and reuseForks instead.
> > [INFO] Skipping execution of surefire because it has already been run for
> > this configuration
> > [INFO]
> > [INFO] --- maven-site-plugin:3.2:site (default) @
> > falcon-oozie-el-extension ---
> > [INFO] maven.site.skip = true: Skipping site generation
> > [INFO]
> > [INFO] --- maven-jar-plugin:2.3.1:jar (default-jar) @
> > falcon-oozie-el-extension ---
> > [INFO]
> > [INFO] --- maven-source-plugin:2.2.1:jar-no-fork (attach-sources) @
> > falcon-oozie-el-extension ---
> > [WARNING] Artifact
> >
> org.apache.falcon:falcon-oozie-el-extension:java-source:sources:0.4-incubating-SNAPSHOT
> > already attached to project, ignoring duplicate
> > [INFO]
> > [INFO] >>> maven-javadoc-plugin:2.8.1:javadoc (attach-javadocs) @
> > falcon-oozie-el-extension >>>
> > [INFO]
> > [INFO] --- buildnumber-maven-plugin:1.0:create (default) @
> > falcon-oozie-el-extension ---
> > [INFO] Checking for local modifications: skipped.
> > [INFO] Updating project files from SCM: skipped.
> > [INFO] Executing: /bin/sh -c cd <
> > https://builds.apache.org/job/Apache-falcon/ws/oozie-el-extensions> &&
> > git show
> > [INFO] Working directory: <
> > https://builds.apache.org/job/Apache-falcon/ws/oozie-el-extensions>
> > [INFO] Storing buildNumber: 9aa2c63a71e2c1d54963bbbee0b7ad19aa908c06 at
> > timestamp: 1376440166936
> > [INFO] Executing: /bin/sh -c cd <
> > https://builds.apache.org/job/Apache-falcon/ws/oozie-el-extensions> &&
> > git show
> > [INFO] Working directory: <
> > https://builds.apache.org/job/Apache-falcon/ws/oozie-el-extensions>
> > [INFO] Storing buildScmBranch: UNKNOWN
> > [INFO]
> > [INFO] <<< maven-javadoc-plugin:2.8.1:javadoc (attach-javadocs) @
> > falcon-oozie-el-extension <<<
> > [INFO]
> > [INFO] --- maven-javadoc-plugin:2.8.1:javadoc (attach-javadocs) @
> > falcon-oozie-el-extension ---
> > [INFO]
> > Loading source files for package org.apache.oozie.extensions...
> > Constructing Javadoc information...
> > Standard Doclet version 1.6.0_26
> > Building tree for all the packages and classes...
> > Generating <
> >
> https://builds.apache.org/job/Apache-falcon/ws/oozie-el-extensions/target/site/apidocs/org/apache/oozie/extensions//OozieELExtensions.html
> ..
> > .>
> > Generating <
> >
> https://builds.apache.org/job/Apache-falcon/ws/oozie-el-extensions/target/site/apidocs/org/apache/oozie/extensions//package-frame.html
> ..
> > .>
> > Generating <
> >
> https://builds.apache.org/job/Apache-falcon/ws/oozie-el-extensions/target/site/apidocs/org/apache/oozie/extensions//package-summary.html
> ..
> > .>
> > Generating <
> >
> https://builds.apache.org/job/Apache-falcon/ws/oozie-el-extensions/target/site/apidocs/org/apache/oozie/extensions//package-tree.html
> ..
> > .>
> > Generating <
> >
> https://builds.apache.org/job/Apache-falcon/ws/oozie-el-extensions/target/site/apidocs/constant-values.html
> ..
> > .>
> > Generating <
> >
> https://builds.apache.org/job/Apache-falcon/ws/oozie-el-extensions/target/site/apidocs/org/apache/oozie/extensions//class-use/OozieELExtensions.html
> ..
> > .>
> > Generating <
> >
> https://builds.apache.org/job/Apache-falcon/ws/oozie-el-extensions/target/site/apidocs/org/apache/oozie/extensions//package-use.html
> ..
> > .>
> > Building index for all the packages and classes...
> > Generating <
> >
> https://builds.apache.org/job/Apache-falcon/ws/oozie-el-extensions/target/site/apidocs/overview-tree.html
> ..
> > .>
> > Generating <
> >
> https://builds.apache.org/job/Apache-falcon/ws/oozie-el-extensions/target/site/apidocs/index-all.html
> ..
> > .>
> > Generating <
> >
> https://builds.apache.org/job/Apache-falcon/ws/oozie-el-extensions/target/site/apidocs/deprecated-list.html
> ..
> > .>
> > Building index for all classes...
> > Generating <
> >
> https://builds.apache.org/job/Apache-falcon/ws/oozie-el-extensions/target/site/apidocs/allclasses-frame.html
> ..
> > .>
> > Generating <
> >
> https://builds.apache.org/job/Apache-falcon/ws/oozie-el-extensions/target/site/apidocs/allclasses-noframe.html
> ..
> > .>
> > Generating <
> >
> https://builds.apache.org/job/Apache-falcon/ws/oozie-el-extensions/target/site/apidocs/index.html
> ..
> > .>
> > Generating <
> >
> https://builds.apache.org/job/Apache-falcon/ws/oozie-el-extensions/target/site/apidocs/help-doc.html
> ..
> > .>
> > Generating <
> >
> https://builds.apache.org/job/Apache-falcon/ws/oozie-el-extensions/target/site/apidocs/stylesheet.css
> ..
> > .>
> > [INFO]
> > [INFO] --- maven-javadoc-plugin:2.8.1:jar (attach-javadocs) @
> > falcon-oozie-el-extension ---
> > [INFO]
> > Loading source files for package org.apache.oozie.extensions...
> > Constructing Javadoc information...
> > Standard Doclet version 1.6.0_26
> > Building tree for all the packages and classes...
> > Generating <
> >
> https://builds.apache.org/job/Apache-falcon/ws/oozie-el-extensions/target/apidocs/org/apache/oozie/extensions//OozieELExtensions.html
> ..
> > .>
> > Generating <
> >
> https://builds.apache.org/job/Apache-falcon/ws/oozie-el-extensions/target/apidocs/org/apache/oozie/extensions//package-frame.html
> ..
> > .>
> > Generating <
> >
> https://builds.apache.org/job/Apache-falcon/ws/oozie-el-extensions/target/apidocs/org/apache/oozie/extensions//package-summary.html
> ..
> > .>
> > Generating <
> >
> https://builds.apache.org/job/Apache-falcon/ws/oozie-el-extensions/target/apidocs/org/apache/oozie/extensions//package-tree.html
> ..
> > .>
> > Generating <
> >
> https://builds.apache.org/job/Apache-falcon/ws/oozie-el-extensions/target/apidocs/constant-values.html
> ..
> > .>
> > Generating <
> >
> https://builds.apache.org/job/Apache-falcon/ws/oozie-el-extensions/target/apidocs/org/apache/oozie/extensions//class-use/OozieELExtensions.html
> ..
> > .>
> > Generating <
> >
> https://builds.apache.org/job/Apache-falcon/ws/oozie-el-extensions/target/apidocs/org/apache/oozie/extensions//package-use.html
> ..
> > .>
> > Building index for all the packages and classes...
> > Generating <
> >
> https://builds.apache.org/job/Apache-falcon/ws/oozie-el-extensions/target/apidocs/overview-tree.html
> ..
> > .>
> > Generating <
> >
> https://builds.apache.org/job/Apache-falcon/ws/oozie-el-extensions/target/apidocs/index-all.html
> ..
> > .>
> > Generating <
> >
> https://builds.apache.org/job/Apache-falcon/ws/oozie-el-extensions/target/apidocs/deprecated-list.html
> ..
> > .>
> > Building index for all classes...
> > Generating <
> >
> https://builds.apache.org/job/Apache-falcon/ws/oozie-el-extensions/target/apidocs/allclasses-frame.html
> ..
> > .>
> > Generating <
> >
> https://builds.apache.org/job/Apache-falcon/ws/oozie-el-extensions/target/apidocs/allclasses-noframe.html
> ..
> > .>
> > Generating <
> >
> https://builds.apache.org/job/Apache-falcon/ws/oozie-el-extensions/target/apidocs/index.html
> ..
> > .>
> > Generating <
> >
> https://builds.apache.org/job/Apache-falcon/ws/oozie-el-extensions/target/apidocs/help-doc.html
> ..
> > .>
> > Generating <
> >
> https://builds.apache.org/job/Apache-falcon/ws/oozie-el-extensions/target/apidocs/stylesheet.css
> ..
> > .>
> > [INFO] Building jar: <
> >
> https://builds.apache.org/job/Apache-falcon/ws/oozie-el-extensions/target/falcon-oozie-el-extension-0.4-incubating-SNAPSHOT-javadoc.jar
> > >
> > [WARNING] Artifact
> >
> org.apache.falcon:falcon-oozie-el-extension:javadoc:javadoc:0.4-incubating-SNAPSHOT
> > already attached to project, ignoring duplicate
> > [INFO]
> > [INFO] --- apache-rat-plugin:0.7:check (rat-check) @
> > falcon-oozie-el-extension ---
> > [INFO] Exclude: *.txt
> > [INFO] Exclude: .git/**
> > [INFO] Exclude: .idea/**
> > [INFO] Exclude: **/*.twiki
> > [INFO] Exclude: **/*.iml
> > [INFO] Exclude: **/target/**
> > [INFO] Exclude: **/activemq-data/**
> > [INFO] Exclude: **/build/**
> > [INFO] Exclude: *.patch
> > [INFO] Exclude: derby.log
> > [INFO] Exclude: **/logs/**
> > [INFO] Exclude: **/.classpath
> > [INFO] Exclude: **/.project
> > [INFO] Exclude: **/.settings/**
> > [INFO] Exclude: **/test-output/**
> > [INFO] Exclude: **/data.txt
> > [INFO]
> > [INFO] --- maven-checkstyle-plugin:2.9.1:check (checkstyle-check) @
> > falcon-oozie-el-extension ---
> > [INFO] Starting audit...
> > Audit done.
> >
> > [INFO]
> > [INFO] >>> findbugs-maven-plugin:2.5.2:check (findbugs-check) @
> > falcon-oozie-el-extension >>>
> > [INFO]
> > [INFO] --- findbugs-maven-plugin:2.5.2:findbugs (findbugs) @
> > falcon-oozie-el-extension ---
> > [INFO] Fork Value is true
> > [INFO] Done FindBugs Analysis....
> > [INFO]
> > [INFO] <<< findbugs-maven-plugin:2.5.2:check (findbugs-check) @
> > falcon-oozie-el-extension <<<
> > [INFO]
> > [INFO] --- findbugs-maven-plugin:2.5.2:check (findbugs-check) @
> > falcon-oozie-el-extension ---
> > [INFO] BugInstance size is 0
> > [INFO] Error size is 0
> > [INFO] No errors/warnings found
> > [INFO]
> > [INFO]
> > ------------------------------------------------------------------------
> > [INFO] Building Apache Falcon Embedded Hadoop - Test Cluster
> > 0.4-incubating-SNAPSHOT
> > [INFO]
> > ------------------------------------------------------------------------
> > [INFO]
> > [INFO] --- maven-clean-plugin:2.4.1:clean (default-clean) @
> > falcon-hadoop-webapp ---
> > [INFO] Deleting <
> > https://builds.apache.org/job/Apache-falcon/ws/hadoop-webapp/target>
> > [INFO]
> > [INFO] --- buildnumber-maven-plugin:1.0:create (default) @
> > falcon-hadoop-webapp ---
> > [INFO] Checking for local modifications: skipped.
> > [INFO] Updating project files from SCM: skipped.
> > [INFO] Executing: /bin/sh -c cd <
> > https://builds.apache.org/job/Apache-falcon/ws/hadoop-webapp> && git
> show
> > [INFO] Working directory: <
> > https://builds.apache.org/job/Apache-falcon/ws/hadoop-webapp>
> > [INFO] Storing buildNumber: 9aa2c63a71e2c1d54963bbbee0b7ad19aa908c06 at
> > timestamp: 1376440179103
> > [INFO] Executing: /bin/sh -c cd <
> > https://builds.apache.org/job/Apache-falcon/ws/hadoop-webapp> && git
> show
> > [INFO] Working directory: <
> > https://builds.apache.org/job/Apache-falcon/ws/hadoop-webapp>
> > [INFO] Storing buildScmBranch: UNKNOWN
> > [INFO]
> > [INFO] --- maven-resources-plugin:2.4.3:resources (default-resources) @
> > falcon-hadoop-webapp ---
> > [INFO] Using 'UTF-8' encoding to copy filtered resources.
> > [INFO] Copying 4 resources
> > [INFO] Copying 1 resource
> > [INFO] Copying 2 resources to META-INF
> > [INFO]
> > [INFO] --- maven-compiler-plugin:2.3.2:compile (default-compile) @
> > falcon-hadoop-webapp ---
> > [INFO] Compiling 1 source file to <
> >
> https://builds.apache.org/job/Apache-falcon/ws/hadoop-webapp/target/classes
> > >
> > [INFO]
> > [INFO] --- maven-resources-plugin:2.4.3:testResources
> > (default-testResources) @ falcon-hadoop-webapp ---
> > [INFO] Using 'UTF-8' encoding to copy filtered resources.
> > [INFO] skip non existing resourceDirectory <
> >
> https://builds.apache.org/job/Apache-falcon/ws/hadoop-webapp/src/test/resources
> > >
> > [INFO]
> > [INFO] --- maven-compiler-plugin:2.3.2:testCompile (default-testCompile)
> @
> > falcon-hadoop-webapp ---
> > [INFO] No sources to compile
> > [INFO]
> > [INFO] --- maven-surefire-plugin:2.14:test (default-test) @
> > falcon-hadoop-webapp ---
> > [INFO] No tests to run.
> > [INFO]
> > [INFO] --- maven-site-plugin:3.2:site (default) @ falcon-hadoop-webapp
> ---
> > [INFO] maven.site.skip = true: Skipping site generation
> > [INFO]
> > [INFO] --- maven-dependency-plugin:2.8:unpack (explode-war) @
> > falcon-hadoop-webapp ---
> > [INFO] Configured Artifact: org.apache.oozie:oozie-webapp:?:war
> > Downloading:
> >
> http://repo1.maven.org/maven2/org/apache/oozie/oozie-webapp/3.2.2/oozie-webapp-3.2.2.war
> >
> > Downloading:
> >
> https://raw.github.com/InMobi/mvn-repo/master/releases/org/apache/oozie/oozie-webapp/3.2.2/oozie-webapp-3.2.2.war
> >
> > Downloading:
> >
> http://repository.codehaus.org/org/apache/oozie/oozie-webapp/3.2.2/oozie-webapp-3.2.2.war
> >
> > Downloading:
> >
> https://repository.apache.org/content/groups/snapshots/org/apache/oozie/oozie-webapp/3.2.2/oozie-webapp-3.2.2.war
> >
> > Downloading:
> >
> https://repository.apache.org/content/groups/public/org/apache/oozie/oozie-webapp/3.2.2/oozie-webapp-3.2.2.war
> >
> > Downloading:
> >
> https://maven.java.net/content/groups/public/org/apache/oozie/oozie-webapp/3.2.2/oozie-webapp-3.2.2.war
> >
> > Downloading:
> >
> https://repository.jboss.org/nexus/content/groups/public/org/apache/oozie/oozie-webapp/3.2.2/oozie-webapp-3.2.2.war
> >
> > Downloading:
> >
> https://repository.cloudera.com/content/groups/cloudera-repos/org/apache/oozie/oozie-webapp/3.2.2/oozie-webapp-3.2.2.war
> >
> > [INFO]
> > ------------------------------------------------------------------------
> > [INFO] Reactor Summary:
> > [INFO]
> > [INFO] Build Tools ....................................... SUCCESS
> [4.820s]
> > [INFO] Apache Falcon ..................................... SUCCESS
> [4.196s]
> > [INFO] Apache Falcon CLI client .......................... SUCCESS
> > [37.189s]
> > [INFO] Apache Falcon Metrics ............................. SUCCESS
> > [14.917s]
> > [INFO] Apache Falcon Test Utility ........................ SUCCESS
> > [14.005s]
> > [INFO] Apache Falcon Commons ............................. SUCCESS
> > [4:25.416s]
> > [INFO] Apache Falcon Oozie EL Extension .................. SUCCESS
> > [18.015s]
> > [INFO] Apache Falcon Embedded Hadoop - Test Cluster ...... FAILURE
> [4.508s]
> > [INFO] Apache Falcon Messaging ........................... SKIPPED
> > [INFO] Apache Falcon Oozie Adaptor ....................... SKIPPED
> > [INFO] Apache Falcon Feed ................................ SKIPPED
> > [INFO] Apache Falcon Process ............................. SKIPPED
> > [INFO] Apache Falcon Acquisition ......................... SKIPPED
> > [INFO] Apache Falcon Replication ......................... SKIPPED
> > [INFO] Apache Falcon Retention ........................... SKIPPED
> > [INFO] Apache Falcon Archival ............................ SKIPPED
> > [INFO] Apache Falcon Rerun ............................... SKIPPED
> > [INFO] Apache Falcon Prism ............................... SKIPPED
> > [INFO] Apache Falcon Web Application ..................... SKIPPED
> > [INFO] Apache Falcon Documentation ....................... SKIPPED
> > [INFO]
> > ------------------------------------------------------------------------
> > [INFO] BUILD FAILURE
> > [INFO]
> > ------------------------------------------------------------------------
> > [INFO] Total time: 6:03.554s
> > [INFO] Finished at: Wed Aug 14 00:29:43 UTC 2013
> > [INFO] Final Memory: 78M/393M
> > [INFO]
> > ------------------------------------------------------------------------
> > [ERROR] Failed to execute goal
> > org.apache.maven.plugins:maven-dependency-plugin:2.8:unpack (explode-war)
> > on project falcon-hadoop-webapp: Unable to find artifact. Could not find
> > artifact org.apache.oozie:oozie-webapp:war:3.2.2 in central (
> > http://repo1.maven.org/maven2)
> > [ERROR]
> > [ERROR] Try downloading the file manually from the project website.
> > [ERROR]
> > [ERROR] Then, install it using the command:
> > [ERROR] mvn install:install-file -DgroupId=org.apache.oozie
> > -DartifactId=oozie-webapp -Dversion=3.2.2 -Dpackaging=war
> > -Dfile=/path/to/file
> > [ERROR]
> > [ERROR] Alternatively, if you host your own repository you can deploy the
> > file there:
> > [ERROR] mvn deploy:deploy-file -DgroupId=org.apache.oozie
> > -DartifactId=oozie-webapp -Dversion=3.2.2 -Dpackaging=war
> > -Dfile=/path/to/file -Durl=[url] -DrepositoryId=[id]
> > [ERROR]
> > [ERROR]
> > [ERROR] org.apache.oozie:oozie-webapp:war:3.2.2
> > [ERROR]
> > [ERROR] from the specified remote repositories:
> > [ERROR] central (http://repo1.maven.org/maven2, releases=true,
> > snapshots=false),
> > [ERROR] im (https://raw.github.com/InMobi/mvn-repo/master/releases,
> > releases=true, snapshots=false),
> > [ERROR] Codehaus repository (http://repository.codehaus.org/,
> > releases=true, snapshots=false),
> > [ERROR] apache.snapshots.repo (
> > https://repository.apache.org/content/groups/snapshots, releases=true,
> > snapshots=true),
> > [ERROR] default (https://repository.apache.org/content/groups/public/,
> > releases=true, snapshots=true),
> > [ERROR] java.net-Public (https://maven.java.net/content/groups/public/,
> > releases=true, snapshots=true),
> > [ERROR] repository.jboss.org-public (
> > https://repository.jboss.org/nexus/content/groups/public, releases=true,
> > snapshots=true),
> > [ERROR] cdh.repo (
> > https://repository.cloudera.com/content/groups/cloudera-repos,
> > releases=true, snapshots=false)
> > [ERROR] -> [Help 1]
> > [ERROR]
> > [ERROR] To see the full stack trace of the errors, re-run Maven with the
> > -e switch.
> > [ERROR] Re-run Maven using the -X switch to enable full debug logging.
> > [ERROR]
> > [ERROR] For more information about the errors and possible solutions,
> > please read the following articles:
> > [ERROR] [Help 1]
> > http://cwiki.apache.org/confluence/display/MAVEN/MojoExecutionException
> > [ERROR]
> > [ERROR] After correcting the problems, you can resume the build with the
> > command
> > [ERROR]   mvn <goals> -rf :falcon-hadoop-webapp
> > Build step 'Execute shell' marked build as failure
> >
>
> --
> _____________________________________________________________
> The information contained in this communication is intended solely for the
> use of the individual or entity to whom it is addressed and others
> authorized to receive it. It may contain confidential or legally privileged
> information. If you are not the intended recipient you are hereby notified
> that any disclosure, copying, distribution or taking any action in reliance
> on the contents of this information is strictly prohibited and may be
> unlawful. If you have received this communication in error, please notify
> us immediately by responding to this email and then delete it from your
> system. The firm is neither liable for the proper and complete transmission
> of the information contained in this communication nor for any delay in its
> receipt.
>



-- 
Regards,
Venkatesh

Phone: (408) 658-8368
EMail: Venkatesh@InnerZeal.com

http://in.linkedin.com/in/seetharamvenkatesh
http://about.me/SeetharamVenkatesh

“Perfection (in design) is achieved not when there is nothing more to add,
but rather when there is nothing more to take away.”
- Antoine de Saint-Exupéry

Mime
  • Unnamed multipart/alternative (inline, None, 0 bytes)
View raw message