falcon-dev mailing list archives

Site index · List index
Message view « Date » · « Thread »
Top « Date » · « Thread »
From Apache Jenkins Server <jenk...@builds.apache.org>
Subject Build failed in Jenkins: Apache-falcon #35
Date Tue, 20 Aug 2013 00:29:29 GMT
See <https://builds.apache.org/job/Apache-falcon/35/changes>

Changes:

[srikanth.sundarrajan] FALCON-62 Falcon compilation with hadoop 2.0 libs. Contributed by Shwetha
GS

[srikanth.sundarrajan] FALCON-79 Fix typos in Falcon architecture document. Contributed by
Suresh Srinivas

------------------------------------------
[...truncated 6586 lines...]
2728 KB   
2732 KB   
2736 KB   
2740 KB   
2744 KB   
2748 KB   
2752 KB   
2756 KB   
2760 KB   
2764 KB   
2768 KB   
2772 KB   
2776 KB   
2780 KB   
2784 KB   
2788 KB   
2792 KB   
2796 KB   
2800 KB   
2804 KB   
2808 KB   
2812 KB   
2816 KB   
2820 KB   
2824 KB   
2828 KB   
2832 KB   
2836 KB   
2840 KB   
2844 KB   
2848 KB   
2852 KB   
2856 KB   
2860 KB   
2864 KB   
2868 KB   
2872 KB   
2876 KB   
2880 KB   
2884 KB   
2888 KB   
2892 KB   
2896 KB   
2900 KB   
2904 KB   
2908 KB   
2912 KB   
2916 KB   
2920 KB   
2924 KB   
2928 KB   
2932 KB   
2936 KB   
2940 KB   
2944 KB   
2948 KB   
2952 KB   
2956 KB   
2960 KB   
2964 KB   
2968 KB   
2972 KB   
2976 KB   
2980 KB   
2984 KB   
2988 KB   
2992 KB   
2996 KB   
3000 KB   
3004 KB   
3008 KB   
3012 KB   
3016 KB   
3020 KB   
3024 KB   
3028 KB   
3032 KB   
3036 KB   
3040 KB   
3044 KB   
3048 KB   
3052 KB   
3056 KB   
3060 KB   
3064 KB   
3068 KB   
3072 KB   
3076 KB   
3080 KB   
3084 KB   
3088 KB   
3092 KB   
3096 KB   
3100 KB   
3104 KB   
3108 KB   
3112 KB   
3116 KB   
3120 KB   
3124 KB   
3128 KB   
3132 KB   
3136 KB   
3140 KB   
3144 KB   
3148 KB   
3152 KB   
3156 KB   
3160 KB   
3164 KB   
3168 KB   
3172 KB   
3176 KB   
3180 KB   
3184 KB   
3188 KB   
3192 KB   
3196 KB   
3200 KB   
3204 KB   
3208 KB   
3212 KB   
3216 KB   
3220 KB   
3224 KB   
3228 KB   
3232 KB   
3236 KB   
3240 KB   
3243 KB   
          
Downloaded: http://repo1.maven.org/maven2/org/apache/activemq/activemq-core/5.4.3/activemq-core-5.4.3.jar
(3243 KB at 9708.3 KB/sec)
[INFO] 
[INFO] --- maven-clean-plugin:2.4.1:clean (default-clean) @ falcon-hadoop-webapp ---
[INFO] Deleting <https://builds.apache.org/job/Apache-falcon/ws/hadoop-webapp/target>
[INFO] 
[INFO] --- buildnumber-maven-plugin:1.0:create (default) @ falcon-hadoop-webapp ---
[INFO] Checking for local modifications: skipped.
[INFO] Updating project files from SCM: skipped.
[INFO] Executing: /bin/sh -c cd <https://builds.apache.org/job/Apache-falcon/ws/hadoop-webapp>
&& git show
[INFO] Working directory: <https://builds.apache.org/job/Apache-falcon/ws/hadoop-webapp>
[INFO] Storing buildNumber: 662c560cb4c43ebaaa48b7a3d5145a6b3ba10a0d at timestamp: 1376958563294
[INFO] Executing: /bin/sh -c cd <https://builds.apache.org/job/Apache-falcon/ws/hadoop-webapp>
&& git show
[INFO] Working directory: <https://builds.apache.org/job/Apache-falcon/ws/hadoop-webapp>
[INFO] Storing buildScmBranch: UNKNOWN
[INFO] 
[INFO] --- maven-resources-plugin:2.4.3:resources (default-resources) @ falcon-hadoop-webapp
---
[INFO] Using 'UTF-8' encoding to copy filtered resources.
[INFO] Copying 5 resources
[INFO] Copying 1 resource
[INFO] Copying 2 resources to META-INF
[INFO] 
[INFO] --- maven-compiler-plugin:2.3.2:compile (default-compile) @ falcon-hadoop-webapp ---
[INFO] Compiling 1 source file to <https://builds.apache.org/job/Apache-falcon/ws/hadoop-webapp/target/classes>
[INFO] 
[INFO] --- maven-resources-plugin:2.4.3:testResources (default-testResources) @ falcon-hadoop-webapp
---
[INFO] Using 'UTF-8' encoding to copy filtered resources.
[INFO] skip non existing resourceDirectory <https://builds.apache.org/job/Apache-falcon/ws/hadoop-webapp/src/test/resources>
[INFO] 
[INFO] --- maven-compiler-plugin:2.3.2:testCompile (default-testCompile) @ falcon-hadoop-webapp
---
[INFO] No sources to compile
[INFO] 
[INFO] --- maven-surefire-plugin:2.14:test (default-test) @ falcon-hadoop-webapp ---
[INFO] No tests to run.
[INFO] 
[INFO] --- maven-site-plugin:3.2:site (default) @ falcon-hadoop-webapp ---
[INFO] maven.site.skip = true: Skipping site generation
[INFO] 
[INFO] --- maven-dependency-plugin:2.8:unpack (explode-war) @ falcon-hadoop-webapp ---
[INFO] Configured Artifact: org.apache.oozie:oozie-webapp:?:war
Downloading: http://repo1.maven.org/maven2/org/apache/oozie/oozie-webapp/3.2.2/oozie-webapp-3.2.2.war
          
Downloading: https://raw.github.com/InMobi/mvn-repo/master/releases/org/apache/oozie/oozie-webapp/3.2.2/oozie-webapp-3.2.2.war
          
Downloading: http://repository.codehaus.org/org/apache/oozie/oozie-webapp/3.2.2/oozie-webapp-3.2.2.war
          
Downloading: https://repository.apache.org/content/groups/snapshots/org/apache/oozie/oozie-webapp/3.2.2/oozie-webapp-3.2.2.war
          
Downloading: https://repository.apache.org/content/groups/public/org/apache/oozie/oozie-webapp/3.2.2/oozie-webapp-3.2.2.war
          
Downloading: https://maven.java.net/content/groups/public/org/apache/oozie/oozie-webapp/3.2.2/oozie-webapp-3.2.2.war
          
Downloading: https://repository.jboss.org/nexus/content/groups/public/org/apache/oozie/oozie-webapp/3.2.2/oozie-webapp-3.2.2.war
          
Downloading: https://repository.cloudera.com/artifactory/cloudera-repos/org/apache/oozie/oozie-webapp/3.2.2/oozie-webapp-3.2.2.war
          
[INFO] ------------------------------------------------------------------------
[INFO] Reactor Summary:
[INFO] 
[INFO] Build Tools ....................................... SUCCESS [4.553s]
[INFO] Apache Falcon ..................................... SUCCESS [4.276s]
[INFO] Apache Falcon CLI client .......................... SUCCESS [34.880s]
[INFO] Apache Falcon Metrics ............................. SUCCESS [14.750s]
[INFO] Apache Falcon Test Utility ........................ SUCCESS [14.164s]
[INFO] Apache Falcon Commons ............................. SUCCESS [4:12.243s]
[INFO] Apache Falcon Oozie EL Extension .................. SUCCESS [18.194s]
[INFO] Apache Falcon Embedded Hadoop - Test Cluster ...... FAILURE [5.443s]
[INFO] Apache Falcon Messaging ........................... SKIPPED
[INFO] Apache Falcon Oozie Adaptor ....................... SKIPPED
[INFO] Apache Falcon Feed ................................ SKIPPED
[INFO] Apache Falcon Process ............................. SKIPPED
[INFO] Apache Falcon Acquisition ......................... SKIPPED
[INFO] Apache Falcon Replication ......................... SKIPPED
[INFO] Apache Falcon Retention ........................... SKIPPED
[INFO] Apache Falcon Archival ............................ SKIPPED
[INFO] Apache Falcon Rerun ............................... SKIPPED
[INFO] Apache Falcon Prism ............................... SKIPPED
[INFO] Apache Falcon Web Application ..................... SKIPPED
[INFO] Apache Falcon Documentation ....................... SKIPPED
[INFO] ------------------------------------------------------------------------
[INFO] BUILD FAILURE
[INFO] ------------------------------------------------------------------------
[INFO] Total time: 5:48.968s
[INFO] Finished at: Tue Aug 20 00:29:28 UTC 2013
[INFO] Final Memory: 78M/266M
[INFO] ------------------------------------------------------------------------
[ERROR] Failed to execute goal org.apache.maven.plugins:maven-dependency-plugin:2.8:unpack
(explode-war) on project falcon-hadoop-webapp: Unable to find artifact. Could not find artifact
org.apache.oozie:oozie-webapp:war:3.2.2 in central (http://repo1.maven.org/maven2)
[ERROR] 
[ERROR] Try downloading the file manually from the project website.
[ERROR] 
[ERROR] Then, install it using the command:
[ERROR] mvn install:install-file -DgroupId=org.apache.oozie -DartifactId=oozie-webapp -Dversion=3.2.2
-Dpackaging=war -Dfile=/path/to/file
[ERROR] 
[ERROR] Alternatively, if you host your own repository you can deploy the file there:
[ERROR] mvn deploy:deploy-file -DgroupId=org.apache.oozie -DartifactId=oozie-webapp -Dversion=3.2.2
-Dpackaging=war -Dfile=/path/to/file -Durl=[url] -DrepositoryId=[id]
[ERROR] 
[ERROR] 
[ERROR] org.apache.oozie:oozie-webapp:war:3.2.2
[ERROR] 
[ERROR] from the specified remote repositories:
[ERROR] central (http://repo1.maven.org/maven2, releases=true, snapshots=false),
[ERROR] im (https://raw.github.com/InMobi/mvn-repo/master/releases, releases=true, snapshots=false),
[ERROR] Codehaus repository (http://repository.codehaus.org/, releases=true, snapshots=false),
[ERROR] apache.snapshots.repo (https://repository.apache.org/content/groups/snapshots, releases=true,
snapshots=true),
[ERROR] default (https://repository.apache.org/content/groups/public/, releases=true, snapshots=true),
[ERROR] java.net-Public (https://maven.java.net/content/groups/public/, releases=true, snapshots=true),
[ERROR] repository.jboss.org-public (https://repository.jboss.org/nexus/content/groups/public,
releases=true, snapshots=true),
[ERROR] cdh.repo (https://repository.cloudera.com/artifactory/cloudera-repos/, releases=true,
snapshots=false)
[ERROR] -> [Help 1]
[ERROR] 
[ERROR] To see the full stack trace of the errors, re-run Maven with the -e switch.
[ERROR] Re-run Maven using the -X switch to enable full debug logging.
[ERROR] 
[ERROR] For more information about the errors and possible solutions, please read the following
articles:
[ERROR] [Help 1] http://cwiki.apache.org/confluence/display/MAVEN/MojoExecutionException
[ERROR] 
[ERROR] After correcting the problems, you can resume the build with the command
[ERROR]   mvn <goals> -rf :falcon-hadoop-webapp
Build step 'Execute shell' marked build as failure

Mime
View raw message