excalibur-scm mailing list archives

Site index · List index
Message view « Date » · « Thread »
Top « Date » · « Thread »
From Gump <...@excalibur.apache.org>
Subject [GUMP@vmgump]: Project excalibur-xmlutil-test (in module excalibur) failed
Date Mon, 28 Dec 2009 09:13:12 GMT
To whom it may engage...
        
This is an automated request, but not an unsolicited one. For 
more information please visit http://gump.apache.org/nagged.html, 
and/or contact the folk at general@gump.apache.org.

Project excalibur-xmlutil-test has an issue affecting its community integration.
This issue affects 1 projects,
 and has been outstanding for 19 runs.
The current state of this project is 'Failed', with reason 'Build Failed'.
For reference only, the following projects are affected by this:
    - excalibur-xmlutil-test :  Repository of reusable components.


Full details are available at:
    http://vmgump.apache.org/gump/public/excalibur/excalibur-xmlutil-test/index.html

That said, some information snippets are provided here.

The following annotations (debug/informational/warning/error messages) were provided:
 -WARNING- Overriding Maven2 settings: [/srv/gump/public/workspace/excalibur/components/xmlutil/gump_mvn_settings.xml]
 -DEBUG- (Gump generated) Maven2 Settings in: /srv/gump/public/workspace/excalibur/components/xmlutil/gump_mvn_settings.xml
 -INFO- Failed with reason build failed
 -DEBUG- Maven POM in: /srv/gump/public/workspace/excalibur/components/xmlutil/pom.xml
 -INFO- Project Reports in: /srv/gump/public/workspace/excalibur/components/xmlutil/target/docs/junitreports
 -WARNING- No directory [/srv/gump/public/workspace/excalibur/components/xmlutil/target/docs/junitreports]



The following work was performed:
http://vmgump.apache.org/gump/public/excalibur/excalibur-xmlutil-test/gump_work/build_excalibur_excalibur-xmlutil-test.html
Work Name: build_excalibur_excalibur-xmlutil-test (Type: Build)
Work ended in a state of : Failed
Elapsed: 15 secs
Command Line: mvn --batch-mode --settings /srv/gump/public/workspace/excalibur/components/xmlutil/gump_mvn_settings.xml
install 
[Working Directory: /srv/gump/public/workspace/excalibur/components/xmlutil]
CLASSPATH: /usr/lib/jvm/java-6-sun/lib/tools.jar:/srv/gump/public/workspace/excalibur/components/xmlutil/target/excalibur-xmlutil-2.2.3-SNAPSHOT.jar
---------------------------------------------
[INFO] [compiler:testCompile]
[INFO] Nothing to compile - all classes are up to date
[INFO] [surefire:test]
[INFO] Surefire report directory: /srv/gump/public/workspace/excalibur/components/xmlutil/target/surefire-reports

-------------------------------------------------------
 T E S T S
-------------------------------------------------------
Running org.apache.excalibur.xml.xpath.test.XPathTestCase
INFO    2009-12-28 09:13:10.154 [XPathTestCase                 ] (): XPathProcessor test case
Tests run: 1, Failures: 0, Errors: 0, Skipped: 0, Time elapsed: 1.385 sec
Running org.apache.excalibur.xml.xpath.test.Saxon6TestCase
INFO    2009-12-28 09:13:11.344 [Saxon6TestCase                ] (): Saxon6Processor test
case
Tests run: 1, Failures: 0, Errors: 0, Skipped: 0, Time elapsed: 0.154 sec
Running org.apache.excalibur.xml.xpath.test.Saxon7TestCase
INFO    2009-12-28 09:13:11.497 [Saxon7TestCase                ] (): Saxon7Processor test
case
Tests run: 1, Failures: 0, Errors: 0, Skipped: 0, Time elapsed: 0.038 sec
Running org.apache.excalibur.xml.dom.test.DefaultDOMParserTestCase
INFO    2009-12-28 09:13:11.537 [DefaultDOMParserTestCase      ] (): DOMHandler factory test
Tests run: 1, Failures: 0, Errors: 0, Skipped: 0, Time elapsed: 0.024 sec
Running org.apache.excalibur.xml.xpath.test.JaxenTestCase
INFO    2009-12-28 09:13:11.560 [JaxenTestCase                 ] (): JaxenProcessor test case
Tests run: 1, Failures: 0, Errors: 0, Skipped: 0, Time elapsed: 0.108 sec
Running org.apache.excalibur.xml.xpath.test.Saxon6ExtTestCase
INFO    2009-12-28 09:13:11.669 [Saxon6ExtTestCase             ] (): Saxon6ExtProcessor test
case
Tests run: 1, Failures: 0, Errors: 0, Skipped: 0, Time elapsed: 0.027 sec
Running org.apache.excalibur.xml.dom.test.DefaultDOMHandlerFactoryTestCase
INFO    2009-12-28 09:13:11.700 [DefaultDOMHandlerFactoryTestCa] (): DOMHandler factory test
Tests run: 1, Failures: 0, Errors: 1, Skipped: 0, Time elapsed: 0.071 sec <<< FAILURE!

Results :

Tests in error: 
  testCreateDOMHandler(org.apache.excalibur.xml.dom.test.DefaultDOMHandlerFactoryTestCase)

Tests run: 7, Failures: 0, Errors: 1, Skipped: 0

[INFO] ------------------------------------------------------------------------
[ERROR] BUILD FAILURE
[INFO] ------------------------------------------------------------------------
[INFO] There are test failures.

Please refer to /srv/gump/public/workspace/excalibur/components/xmlutil/target/surefire-reports
for the individual test results.
[INFO] ------------------------------------------------------------------------
[INFO] For more information, run Maven with the -e switch
[INFO] ------------------------------------------------------------------------
[INFO] Total time: 14 seconds
[INFO] Finished at: Mon Dec 28 09:13:11 PST 2009
[INFO] Final Memory: 14M/26M
[INFO] ------------------------------------------------------------------------
---------------------------------------------

To subscribe to this information via syndicated feeds:
- RSS: http://vmgump.apache.org/gump/public/excalibur/excalibur-xmlutil-test/rss.xml
- Atom: http://vmgump.apache.org/gump/public/excalibur/excalibur-xmlutil-test/atom.xml

============================== Gump Tracking Only ===
Produced by Gump version 2.3.
Gump Run 27000028122009, vmgump:vmgump-public:27000028122009
Gump E-mail Identifier (unique within run) #56.

--
Apache Gump
http://gump.apache.org/ [Instance: vmgump]

---------------------------------------------------------------------
To unsubscribe, e-mail: scm-unsubscribe@excalibur.apache.org
For additional commands, e-mail: scm-help@excalibur.apache.org


Mime
View raw message