excalibur-scm mailing list archives

Site index · List index
Message view « Date » · « Thread »
Top « Date » · « Thread »
From Gump <...@excalibur.apache.org>
Subject [GUMP@vmgump]: Project excalibur-store-test (in module excalibur) failed
Date Thu, 15 Oct 2009 04:50:04 GMT
To whom it may engage...
        
This is an automated request, but not an unsolicited one. For 
more information please visit http://gump.apache.org/nagged.html, 
and/or contact the folk at general@gump.apache.org.

Project excalibur-store-test has an issue affecting its community integration.
This issue affects 1 projects.
The current state of this project is 'Failed', with reason 'Build Failed'.
For reference only, the following projects are affected by this:
    - excalibur-store-test :  Repository of reusable components.


Full details are available at:
    http://vmgump.apache.org/gump/public/excalibur/excalibur-store-test/index.html

That said, some information snippets are provided here.

The following annotations (debug/informational/warning/error messages) were provided:
 -WARNING- Overriding Maven2 settings: [/srv/gump/public/workspace/excalibur/components/store/gump_mvn_settings.xml]
 -DEBUG- (Gump generated) Maven2 Settings in: /srv/gump/public/workspace/excalibur/components/store/gump_mvn_settings.xml
 -INFO- Failed with reason build failed
 -DEBUG- Maven POM in: /srv/gump/public/workspace/excalibur/components/store/pom.xml
 -INFO- Project Reports in: /srv/gump/public/workspace/excalibur/components/store/target/docs/junitreports
 -WARNING- No directory [/srv/gump/public/workspace/excalibur/components/store/target/docs/junitreports]



The following work was performed:
http://vmgump.apache.org/gump/public/excalibur/excalibur-store-test/gump_work/build_excalibur_excalibur-store-test.html
Work Name: build_excalibur_excalibur-store-test (Type: Build)
Work ended in a state of : Failed
Elapsed: 23 secs
Command Line: mvn --batch-mode --settings /srv/gump/public/workspace/excalibur/components/store/gump_mvn_settings.xml
install 
[Working Directory: /srv/gump/public/workspace/excalibur/components/store]
CLASSPATH: /usr/lib/jvm/java-6-sun/lib/tools.jar:/srv/gump/public/workspace/excalibur/components/store/target/excalibur-store-2.2.3-SNAPSHOT.jar:/srv/gump/public/workspace/junit/dist/junit-15102009.jar
---------------------------------------------
Downloading: http://dist.codehaus.org/generama/qdox/20051211.114207/qdox-20051211.114207.pom
Downloading: http://dist.codehaus.org/generama/poms/qdox-20051211.114207.pom
Downloading: http://localhost:8192/maven2/generama/qdox/20051211.114207/qdox-20051211.114207.pom
[INFO] [fortress:collect-metainfo {execution: default}]
[INFO] Writing Info descriptors as property files (.meta).
[INFO] Collecting service information.
[INFO] Processing service org.apache.excalibur.store.Store
[INFO] Processing service org.apache.excalibur.store.impl.Store
[INFO] Processing service org.apache.excalibur.store.impl.StoreJanitor
[INFO] Processing service org.apache.excalibur.store.StoreJanitor
[INFO] [resources:testResources]
[INFO] Using 'UTF-8' encoding to copy filtered resources.
[INFO] Copying 0 resource
[INFO] Copying 3 resources
[INFO] [compiler:testCompile]
[INFO] Nothing to compile - all classes are up to date
[INFO] [surefire:test]
[INFO] Surefire report directory: /srv/gump/public/workspace/excalibur/components/store/target/surefire-reports

-------------------------------------------------------
 T E S T S
-------------------------------------------------------
Running org.apache.excalibur.store.impl.ClearJispFilesystemStoreTestCase
[DEBUG] -BGN--> setUp() fixture for testRemove
[DEBUG] filling the database...
[DEBUG] -BGN--> setUp() fixture for testClear
[DEBUG] filling the database...
Tests run: 2, Failures: 0, Errors: 2, Skipped: 0, Time elapsed: 0.257 sec <<< FAILURE!

Results :

Tests in error: 
  testRemove(org.apache.excalibur.store.impl.ClearJispFilesystemStoreTestCase)
  testClear(org.apache.excalibur.store.impl.ClearJispFilesystemStoreTestCase)

Tests run: 2, Failures: 0, Errors: 2, Skipped: 0

[INFO] ------------------------------------------------------------------------
[ERROR] BUILD FAILURE
[INFO] ------------------------------------------------------------------------
[INFO] There are test failures.

Please refer to /srv/gump/public/workspace/excalibur/components/store/target/surefire-reports
for the individual test results.
[INFO] ------------------------------------------------------------------------
[INFO] For more information, run Maven with the -e switch
[INFO] ------------------------------------------------------------------------
[INFO] Total time: 22 seconds
[INFO] Finished at: Thu Oct 15 04:50:03 PDT 2009
[INFO] Final Memory: 14M/26M
[INFO] ------------------------------------------------------------------------
---------------------------------------------

To subscribe to this information via syndicated feeds:
- RSS: http://vmgump.apache.org/gump/public/excalibur/excalibur-store-test/rss.xml
- Atom: http://vmgump.apache.org/gump/public/excalibur/excalibur-store-test/atom.xml

============================== Gump Tracking Only ===
Produced by Gump version 2.3.
Gump Run 05000015102009, vmgump:vmgump-public:05000015102009
Gump E-mail Identifier (unique within run) #30.

--
Apache Gump
http://gump.apache.org/ [Instance: vmgump]

---------------------------------------------------------------------
To unsubscribe, e-mail: scm-unsubscribe@excalibur.apache.org
For additional commands, e-mail: scm-help@excalibur.apache.org


Mime
View raw message