excalibur-dev mailing list archives

Site index · List index
Message view « Date » · « Thread »
Top « Date » · « Thread »
From J Aaron Farr <jaaronf...@gmail.com>
Subject Re: [GUMP@vmgump]: Project excalibur-thread-impl (in module excalibur) failed
Date Sun, 11 Dec 2005 17:19:54 GMT
On 12/10/05, Gump <dev@excalibur.apache.org> wrote:
> To whom it may engage...
>
...
>     [junit] [ERROR] TEST org.apache.avalon.excalibur.thread.impl.test.ResourceLimitingThreadPoolTestCase
FAILED
>     [junit] Running org.apache.avalon.excalibur.thread.impl.test.DefaultThreadPoolTestCase
>     [junit] Tests run: 2, Failures: 0, Errors: 0, Time elapsed: 1.735 sec
>
> BUILD FAILED
> File...... /home/gump/.maven/cache/maven-test-plugin-1.6.2/plugin.jelly
> Element... fail
> Line...... 181
> Column.... 54
> There were test failures.
> Total time: 24 seconds
> Finished at: Sat Dec 10 07:09:12 PST 2005

FYI:

I've gotten this on my machine too, but if you directly run, say
"maven jar:install" on this project, the test passes.  So something is
slowing down the tests during the multiproject builds.

--
  jaaron

---------------------------------------------------------------------
To unsubscribe, e-mail: dev-unsubscribe@excalibur.apache.org
For additional commands, e-mail: dev-help@excalibur.apache.org


Mime
View raw message