esme-dev mailing list archives

Site index · List index
Message view « Date » · « Thread »
Top « Date » · « Thread »
From Apache Jenkins Server <jenk...@builds.apache.org>
Subject Build failed in Jenkins: ESME #1294
Date Thu, 09 May 2013 12:36:25 GMT
See <https://builds.apache.org/job/ESME/1294/>

------------------------------------------
Started by timer
Building remotely on solaris1 in workspace <https://builds.apache.org/job/ESME/ws/>
Updating http://svn.apache.org/repos/asf/esme/trunk/server
At revision 1480601
no change for http://svn.apache.org/repos/asf/esme/trunk/server since the previous build
Parsing POMs
[server] $ /zonestorage/hudson_solaris/home/hudson/hudson-slave/tools/jdk6-u26-auto-install//bin/java
-cp /export/home/hudson/hudson-slave/maven-agent.jar:/export/home/hudson/hudson-slave/classworlds.jar
hudson.maven.agent.Main /home/hudson/tools/maven/apache-maven-2.2.1 /zonestorage/hudson_solaris/home/hudson/hudson-slave/slave.jar
/export/home/hudson/hudson-slave/maven-interceptor.jar 42887 /export/home/hudson/hudson-slave/maven2.1-interceptor.jar
<===[JENKINS REMOTING CAPACITY]===>   channel started
log4j:WARN No appenders could be found for logger (org.apache.commons.beanutils.converters.BooleanConverter).
log4j:WARN Please initialize the log4j system properly.
Executing Maven:  -B -f <https://builds.apache.org/job/ESME/ws/server/pom.xml> -Dmaven.repo.local=/export/home/hudson/hudson-slave/maven-repositories/1
clean install
[INFO] Scanning for projects...
[INFO] ------------------------------------------------------------------------
[INFO] Building Apache Enterprise Social Messaging Environment (ESME)
[INFO]    task-segment: [clean, install]
[INFO] ------------------------------------------------------------------------
[INFO] [clean:clean {execution: default-clean}]
[INFO] Deleting directory <https://builds.apache.org/job/ESME/ws/server/target>
[INFO] [resources:resources {execution: default-resources}]
[WARNING] Using platform encoding (ISO646-US actually) to copy filtered resources, i.e. build
is platform dependent!
[INFO] Copying 13 resources
[INFO] [yuicompressor:compress {execution: default}]
[INFO] nb warnings: 0, nb errors: 0
[INFO] [compiler:compile {execution: default-compile}]
[INFO] Nothing to compile - all classes are up to date
[INFO] [scala:compile {execution: default}]
[INFO] suggestion: remove the scalaVersion from pom.xml
[ERROR] <https://builds.apache.org/job/ESME/ws/server/src/main/scala>
[ERROR] <https://builds.apache.org/job/ESME/ws/server/src/main/scala/../scala>
[INFO] Compiling 66 source files to /zonestorage/hudson_solaris/home/hudson/hudson-slave/workspace/ESME/server/target/classes
[INFO] Java HotSpot(TM) Server VM warning: CodeCache is full. Compiler has been disabled.
[INFO] Java HotSpot(TM) Server VM warning: Try increasing the code cache size using -XX:ReservedCodeCacheSize=
[INFO] #
[INFO] # A fatal error has been detected by the Java Runtime Environment:
[INFO] #
[INFO] #  Internal Error (0xe0000000), pid=24887, tid=2
[INFO] #  Error: An uncaught C++ exception
[INFO] #
[INFO] # JRE version: 6.0_26-b03
[INFO] # Java VM: Java HotSpot(TM) Server VM (20.1-b02 mixed mode solaris-x86 )
[INFO] # An error report file with more information is saved as:
[INFO] # /zonestorage/hudson_solaris/home/hudson/hudson-slave/workspace/ESME/server/hs_err_pid24887.log
[INFO] #
[INFO] # If you would like to submit a bug report, please visit:
[INFO] #   http://java.sun.com/webapps/bugreport/crash.jsp
[INFO] #
[JENKINS] Archiving <https://builds.apache.org/job/ESME/ws/server/pom.xml> to /home/hudson/hudson/jobs/ESME/modules/org.apache.esme$esme-server/builds/2013-05-09_12-26-51/archive/org.apache.esme/esme-server/apache-esme-1.4/esme-server-apache-esme-1.4.pom
[INFO] ------------------------------------------------------------------------
[ERROR] BUILD FAILURE
[INFO] ------------------------------------------------------------------------
[INFO] command line returned non-zero value:6
[INFO] ------------------------------------------------------------------------
[INFO] For more information, run Maven with the -e switch
[INFO] ------------------------------------------------------------------------
[INFO] Total time: 4 minutes 57 seconds
[INFO] Finished at: Thu May 09 12:35:39 GMT+00:00 2013
[INFO] Final Memory: 34M/221M
[INFO] ------------------------------------------------------------------------
Sending e-mails to: dev@esme.apache.org
channel stopped
[WARNINGS] Skipping publisher since build result is FAILURE

Mime
View raw message