esme-dev mailing list archives

Site index · List index
Message view « Date » · « Thread »
Top « Date » · « Thread »
From Apache Jenkins Server <jenk...@builds.apache.org>
Subject Build failed in Jenkins: ESME #1088
Date Fri, 05 Oct 2012 13:38:58 GMT
See <https://builds.apache.org/job/ESME/1088/>

------------------------------------------
Started by timer
Building remotely on solaris1 in workspace <https://builds.apache.org/job/ESME/ws/>
Updating http://svn.apache.org/repos/asf/esme/trunk/server
At revision 1394480
no change for http://svn.apache.org/repos/asf/esme/trunk/server since the previous build
Parsing POMs
[server] $ /home/hudson/tools/java/latest1.6/bin/java -cp /export/home/hudson/hudson-slave/maven-agent.jar:/export/home/hudson/hudson-slave/classworlds.jar
hudson.maven.agent.Main /home/hudson/tools/maven/latest /zonestorage/hudson_solaris/home/hudson/hudson-slave/slave.jar
/export/home/hudson/hudson-slave/maven-interceptor.jar 50185 /export/home/hudson/hudson-slave/maven2.1-interceptor.jar
<===[JENKINS REMOTING CAPACITY]===>   channel started
log4j:WARN No appenders could be found for logger (org.apache.commons.beanutils.converters.BooleanConverter).
log4j:WARN Please initialize the log4j system properly.
Executing Maven:  -B -f <https://builds.apache.org/job/ESME/ws/server/pom.xml> -Dmaven.repo.local=/export/home/hudson/hudson-slave/maven-repositories/1
clean install
[INFO] Scanning for projects...
[INFO] ------------------------------------------------------------------------
[INFO] Building Apache Enterprise Social Messaging Environment (ESME)
[INFO]    task-segment: [clean, install]
[INFO] ------------------------------------------------------------------------
[INFO] [clean:clean {execution: default-clean}]
[INFO] Deleting directory <https://builds.apache.org/job/ESME/ws/server/target>
[INFO] [resources:resources {execution: default-resources}]
[WARNING] Using platform encoding (ISO646-US actually) to copy filtered resources, i.e. build
is platform dependent!
[INFO] Copying 13 resources
[INFO] [yuicompressor:compress {execution: default}]
[INFO] nb warnings: 0, nb errors: 0
[INFO] [compiler:compile {execution: default-compile}]
[INFO] Nothing to compile - all classes are up to date
[INFO] [scala:compile {execution: default}]
[INFO] suggestion: remove the scalaVersion from pom.xml
[ERROR] <https://builds.apache.org/job/ESME/ws/server/src/main/scala>
[ERROR] <https://builds.apache.org/job/ESME/ws/server/src/main/scala/../scala>
[INFO] Compiling 66 source files to /zonestorage/hudson_solaris/home/hudson/hudson-slave/workspace/ESME/server/target/classes
[WARNING] warning: there were 13 unchecked warnings; re-run with -unchecked for details
[WARNING] one warning found
[INFO] [resources:testResources {execution: default-testResources}]
[WARNING] Using platform encoding (ISO646-US actually) to copy filtered resources, i.e. build
is platform dependent!
[INFO] skip non existing resourceDirectory <https://builds.apache.org/job/ESME/ws/server/src/test/resources>
[INFO] [compiler:testCompile {execution: default-testCompile}]
[INFO] Nothing to compile - all classes are up to date
[INFO] [scala:testCompile {execution: default}]
[INFO] suggestion: remove the scalaVersion from pom.xml
[ERROR] <https://builds.apache.org/job/ESME/ws/server/src/test/scala>
[ERROR] <https://builds.apache.org/job/ESME/ws/server/src/test/scala/../scala>
[INFO] Compiling 8 source files to /zonestorage/hudson_solaris/home/hudson/hudson-slave/workspace/ESME/server/target/test-classes
[WARNING] warning: there were 29 deprecation warnings; re-run with -deprecation for details
[WARNING] one warning found
[INFO] [surefire:test {execution: default-test}]
[INFO] Surefire report directory: <https://builds.apache.org/job/ESME/ws/server/target/surefire-reports>

-------------------------------------------------------
 T E S T S
-------------------------------------------------------
Running org.apache.esme.actor.PopStatsActorSpecsAsTest
Tests run: 2, Failures: 0, Errors: 0, Skipped: 0, Time elapsed: 6.164 sec
Running org.apache.esme.AppTest
Tests run: 1, Failures: 0, Errors: 0, Skipped: 0, Time elapsed: 0.006 sec
Running org.apache.esme.api.Api2SpecsAsTest
log4j:WARN No appenders could be found for logger (org.mortbay.log).
log4j:WARN Please initialize the log4j system properly.
log4j:WARN See http://logging.apache.org/log4j/1.2/faq.html#noconfig for more info.
:12:203: '/' expected instead of ' '

                                                                                         
                                                                                         
                      ^
:12:203: '/' expected instead of ' '

                                                                                         
                                                                                         
                      ^
:12:203: '/' expected instead of ' '

                                                                                         
                                                                                         
                      ^
Tests run: 66, Failures: 1, Errors: 0, Skipped: 0, Time elapsed: 69.008 sec <<< FAILURE!
Running org.apache.esme.api.TwitterAPISpecsAsTest
Tests run: 14, Failures: 0, Errors: 0, Skipped: 0, Time elapsed: 8.765 sec
Running org.apache.esme.api.ApiSpecsAsTest
Tests run: 14, Failures: 10, Errors: 0, Skipped: 0, Time elapsed: 6.949 sec <<< FAILURE!

Results :

Failed tests: 
  with valid session(org.apache.esme.api.Api2Specs$): 
  StatusNeg(org.apache.esme.api.ApiSpecs$): 
  Logout(org.apache.esme.api.ApiSpecs$): 
  LogoutNeg(org.apache.esme.api.ApiSpecs$): 
  SendMsg(org.apache.esme.api.ApiSpecs$): 
  SendMsgNeg(org.apache.esme.api.ApiSpecs$): 
  AddAction(org.apache.esme.api.ApiSpecs$): 
  AddActionNeg(org.apache.esme.api.ApiSpecs$): 
  SendMessageToken(org.apache.esme.api.ApiSpecs$): 
  AddPool(org.apache.esme.api.ApiSpecs$): 
  AddPoolNeg(org.apache.esme.api.ApiSpecs$): 

Tests run: 97, Failures: 11, Errors: 0, Skipped: 0

[ERROR] There are test failures.

Please refer to <https://builds.apache.org/job/ESME/ws/server/target/surefire-reports>
for the individual test results.
[JENKINS] Recording test results
[INFO] [war:war {execution: default-war}]
[INFO] Packaging webapp
[INFO] Assembling webapp[esme-server] in [<https://builds.apache.org/job/ESME/ws/server/target/esme-server-apache-esme-1.4]>
[INFO] Processing war project
[INFO] Copying webapp resources[<https://builds.apache.org/job/ESME/ws/server/src/main/webapp]>
[INFO] Webapp assembled in[11728 msecs]
[INFO] Building war: <https://builds.apache.org/job/ESME/ws/server/target/esme-server-apache-esme-1.4.war>
[INFO] [install:install {execution: default-install}]
[INFO] Installing <https://builds.apache.org/job/ESME/ws/server/target/esme-server-apache-esme-1.4.war>
to /export/home/hudson/hudson-slave/maven-repositories/1/org/apache/esme/esme-server/apache-esme-1.4/esme-server-apache-esme-1.4.war
[JENKINS] Archiving <https://builds.apache.org/job/ESME/ws/server/pom.xml> to /home/hudson/hudson/jobs/ESME/modules/org.apache.esme$esme-server/builds/2012-10-05_12-28-49/archive/org.apache.esme/esme-server/apache-esme-1.4/esme-server-apache-esme-1.4.pom
[JENKINS] Archiving <https://builds.apache.org/job/ESME/ws/server/target/esme-server-apache-esme-1.4.war>
to /home/hudson/hudson/jobs/ESME/modules/org.apache.esme$esme-server/builds/2012-10-05_12-28-49/archive/org.apache.esme/esme-server/apache-esme-1.4/esme-server-apache-esme-1.4.war
Build timed out (after 70 minutes). Marking the build as failed.
channel stopped
[INFO] ------------------------------------------------------------------------
[ERROR] FATAL ERROR
[INFO] ------------------------------------------------------------------------
[INFO] hudson.remoting.RequestAbortedException: hudson.remoting.Channel$OrderlyShutdown
[INFO] ------------------------------------------------------------------------
[INFO] Trace
hudson.remoting.RequestAbortedException: hudson.remoting.RequestAbortedException: hudson.remoting.Channel$OrderlyShutdown
	at hudson.remoting.Request.call(Request.java:174)
	at hudson.remoting.Channel.call(Channel.java:664)
	at hudson.remoting.RemoteInvocationHandler.invoke(RemoteInvocationHandler.java:158)
	at $Proxy2.isArchivingDisabled(Unknown Source)
	at hudson.maven.MavenBuildProxy$Filter.isArchivingDisabled(MavenBuildProxy.java:227)
	at hudson.maven.reporters.MavenArtifact.archive(MavenArtifact.java:223)
	at hudson.maven.reporters.MavenArtifactArchiver.postBuild(MavenArtifactArchiver.java:108)
	at hudson.maven.Maven2Builder.postModule(Maven2Builder.java:127)
	at hudson.maven.MavenBuilder$Adapter.fireLeaveModule(MavenBuilder.java:327)
	at hudson.maven.MavenBuilder$Adapter.postBuild(MavenBuilder.java:285)
	at org.apache.maven.lifecycle.LifecycleExecutorInterceptor.execute(LifecycleExecutorInterceptor.java:68)
	at org.apache.maven.DefaultMaven.doExecute(DefaultMaven.java:328)
	at org.apache.maven.DefaultMaven.execute(DefaultMaven.java:138)
	at org.apache.maven.cli.MavenCli.main(MavenCli.java:362)
	at sun.reflect.NativeMethodAccessorImpl.invoke0(Native Method)
	at sun.reflect.NativeMethodAccessorImpl.invoke(NativeMethodAccessorImpl.java:39)
	at sun.reflect.DelegatingMethodAccessorImpl.invoke(DelegatingMethodAccessorImpl.java:25)
	at java.lang.reflect.Method.invoke(Method.java:597)
	at org.codehaus.classworlds.Launcher.launchEnhanced(Launcher.java:315)
	at org.codehaus.classworlds.Launcher.launch(Launcher.java:255)
	at hudson.maven.agent.Main.launch(Main.java:185)
	at hudson.maven.MavenBuilder.call(MavenBuilder.java:151)
	at hudson.maven.Maven2Builder.call(Maven2Builder.java:77)
	at hudson.maven.Maven2Builder.call(Maven2Builder.java:53)
	at hudson.remoting.UserRequest.perform(UserRequest.java:118)
	at hudson.remoting.UserRequest.perform(UserRequest.java:48)
	at hudson.remoting.Request$2.run(Request.java:326)
	at hudson.remoting.InterceptingExecutorService$1.call(InterceptingExecutorService.java:72)
	at java.util.concurrent.FutureTask$Sync.innerRun(FutureTask.java:303)
	at java.util.concurrent.FutureTask.run(FutureTask.java:138)
	at java.util.concurrent.ThreadPoolExecutor$Worker.runTask(ThreadPoolExecutor.java:886)
	at java.util.concurrent.ThreadPoolExecutor$Worker.run(ThreadPoolExecutor.java:908)
	at java.lang.Thread.run(Thread.java:662)
Caused by: hudson.remoting.RequestAbortedException: hudson.remoting.Channel$OrderlyShutdown
	at hudson.remoting.Request.abort(Request.java:299)
	at hudson.remoting.Channel.terminate(Channel.java:724)
	at hudson.remoting.Channel$CloseCommand.execute(Channel.java:842)
	at hudson.remoting.Channel$2.handle(Channel.java:434)
	at hudson.remoting.SynchronousCommandTransport$ReaderThread.run(SynchronousCommandTransport.java:60)
Caused by: hudson.remoting.Channel$OrderlyShutdown
	... 3 more
Caused by: Command close created at
	at hudson.remoting.Command.<init>(Command.java:54)
	at hudson.remoting.Channel$CloseCommand.<init>(Channel.java:836)
	at hudson.remoting.Channel$CloseCommand.<init>(Channel.java:834)
	at hudson.remoting.Channel.close(Channel.java:901)
	at hudson.remoting.Channel.close(Channel.java:884)
	at hudson.slaves.Channels$1.close(Channels.java:91)
	at hudson.maven.ProcessCache$MavenProcess.discard(ProcessCache.java:145)
	at hudson.maven.MavenModuleSetBuild$MavenModuleSetBuildExecution.doRun(MavenModuleSetBuild.java:796)
	at hudson.model.AbstractBuild$AbstractBuildExecution.run(AbstractBuild.java:499)
	at hudson.model.Run.execute(Run.java:1502)
	at hudson.maven.MavenModuleSetBuild.run(MavenModuleSetBuild.java:477)
	at hudson.model.ResourceController.execute(ResourceController.java:88)
	at hudson.model.Executor.run(Executor.java:236)
[INFO] ------------------------------------------------------------------------
[INFO] Total time: 55 minutes 31 seconds
[INFO] Finished at: Fri Oct 05 13:39:29 GMT+00:00 2012
[INFO] Final Memory: 40M/342M
[INFO] ------------------------------------------------------------------------
[WARNINGS] Skipping publisher since build result is FAILURE

Mime
View raw message