esme-dev mailing list archives

Site index · List index
Message view « Date » · « Thread »
Top « Date » · « Thread »
From Apache Jenkins Server <jenk...@builds.apache.org>
Subject Build failed in Jenkins: ESME #869
Date Wed, 22 Feb 2012 12:11:26 GMT
See <https://builds.apache.org/job/ESME/869/>

------------------------------------------
[...truncated 152 lines...]
AU        src/main/webapp/images/sort_asc_disabled.png
AU        src/main/webapp/images/btn-signup-big.gif
AU        src/main/webapp/images/back_enabled.jpg
AU        src/main/webapp/images/btn-search.gif
AU        src/main/webapp/images/heading-left.gif
AU        src/main/webapp/images/ajax-loader.gif
AU        src/main/webapp/images/forward_enabled.jpg
AU        src/main/webapp/images/avatar.jpg
AU        src/main/webapp/images/bg-box-right.gif
AU        src/main/webapp/images/bg-home.jpg
AU        src/main/webapp/images/login-bot.gif
AU        src/main/webapp/images/prev.png
AU        src/main/webapp/images/sort_desc_disabled.png
AU        src/main/webapp/images/back_disabled.jpg
AU        src/main/webapp/images/btn-update.gif
AU        src/main/webapp/images/tab.gif
AU        src/main/webapp/images/first.png
AU        src/main/webapp/images/forward_disabled.jpg
AU        src/main/webapp/images/login-top.gif
AU        src/main/webapp/images/Esme_icon.new.png
AU        src/main/webapp/images/btn-signout.gif
AU        src/main/webapp/images/new1.gif
AU        src/main/webapp/images/bg-main-header.jpg
AU        src/main/webapp/images/bg-right-back.jpg
AU        src/main/webapp/images/btn-signon.gif
AU        src/main/webapp/images/heading.png
AU        src/main/webapp/images/heading1.gif
AU        src/main/webapp/images/sort_both.png
AU        src/main/webapp/images/heading-bg.gif
AU        src/main/webapp/images/edit.gif
AU        src/main/webapp/images/btn-signup.gif
AU        src/main/webapp/images/esme-logo.gif
AU        src/main/webapp/images/bg-update.png
AU        src/main/webapp/images/line.gif
AU        src/main/webapp/images/bg-search.gif
AU        src/main/webapp/images/sort_asc.png
AU        src/main/webapp/images/next.png
AU        src/main/webapp/images/bg-tabs.png
AU        src/main/webapp/images/login-bg.gif
AU        src/main/webapp/images/heading.gif
AU        src/main/webapp/images/bg-back.jpg
AU        src/main/webapp/images/sort_desc.png
AU        src/main/webapp/images/add1.gif
AU        src/main/webapp/images/heading-right.gif
A         src/main/webapp/info_view
A         src/main/webapp/info_view/contacts.html
A         src/main/webapp/info_view/public.html
AU        src/main/webapp/info_view/streams.html
A         src/main/webapp/info_view/user.html
A         src/main/webapp/info_view/users.html
AU        src/main/webapp/info_view/search.html
A         src/main/webapp/info_view/messages.html
AU        src/main/webapp/info_view/conversation.html
A         src/main/webapp/info_view/tag.html
A         src/main/webapp/pools_view
AU        src/main/webapp/pools_view/index.html
A         src/main/webapp/WEB-INF
A         src/main/webapp/WEB-INF/sun-web.xml
A         src/main/webapp/WEB-INF/web.xml
A         src/main/webapp/action_view
A         src/main/webapp/action_view/index.html
A         src/main/webapp/scripts
A         src/main/webapp/scripts/jquery.dataTables.min.js
A         src/main/webapp/scripts/jquery.validate.js
A         src/main/webapp/scripts/display_single_message.js
A         src/main/webapp/scripts/display_messages_top.js
A         src/main/webapp/scripts/esme_table_sorter_users.js
A         src/main/webapp/scripts/esme_table_sorter_track.js
A         src/main/webapp/scripts/dialog_track.js
A         src/main/webapp/scripts/pretty.js
A         src/main/webapp/scripts/jquery.TipTip.js
A         src/main/webapp/scripts/dialog_pool.js
A         src/main/webapp/scripts/esme.js
A         src/main/webapp/scripts/esme_table_sorter_tag.js
A         src/main/webapp/scripts/jquery-ui-1.8.2.custom.min.js
A         src/main/webapp/scripts/esme_table_sorter_action.js
A         src/main/webapp/scripts/dialog_action.js
A         src/main/webapp/scripts/esme_table_sorter_token.js
A         src/main/webapp/scripts/dialog_token.js
A         src/main/webapp/scripts/esme_validate.js
A         src/main/webapp/scripts/esme_tool_tip.js
A         src/main/webapp/templates-hidden
A         src/main/webapp/templates-hidden/message_update_box.html
A         src/main/webapp/templates-hidden/upw_signup_form.html
A         src/main/webapp/templates-hidden/default.html
A         src/main/webapp/templates-hidden/upw_login_form.html
A         src/main/webapp/templates-hidden/default_signup.html
A         src/main/webapp/templates-hidden/base.html
A         src/main/webapp/signup.html
A         src/main/webapp/index.html
A         src/main/webapp/profile_view
AU        src/main/webapp/profile_view/edit.html
A         src/main/webapp/auth_view
AU        src/main/webapp/auth_view/index.html
AU        src/main/webapp/favicon.ico
A         src/main/webapp/track_view
AU        src/main/webapp/track_view/index.html
A         pom.xml
 U        .
At revision 1292250
no revision recorded for http://svn.apache.org/repos/asf/esme/trunk/server in the previous
build
Parsing POMs
[server] $ /home/hudson/tools/java/latest1.6/bin/java -cp /home/jenkins/jenkins-slave/maven3-agent.jar:/home/hudson/tools/maven/latest/boot/plexus-classworlds-2.4.jar
org.jvnet.hudson.maven3.agent.Maven3Main /home/hudson/tools/maven/latest /x1/jenkins/jenkins-slave/slave.jar
/home/jenkins/jenkins-slave/maven3-interceptor.jar 36939
<===[JENKINS REMOTING CAPACITY]===>   channel started
Executing Maven:  -B -f <https://builds.apache.org/job/ESME/ws/server/pom.xml> clean
install
[INFO] Scanning for projects...
[WARNING] 
[WARNING] Some problems were encountered while building the effective model for org.apache.esme:esme-server:war:apache-esme-1.4
[WARNING] 'dependencies.dependency.(groupId:artifactId:type:classifier)' must be unique: junit:junit:jar
-> version 3.8.1 vs 4.4 @ line 308, column 21
[WARNING] 'build.plugins.plugin.version' for org.mortbay.jetty:maven-jetty-plugin is missing.
@ line 344, column 21
[WARNING] 'build.plugins.plugin.version' for net.sf.alchim:yuicompressor-maven-plugin is missing.
@ line 352, column 21
[WARNING] 'build.plugins.plugin.version' for org.apache.rat:apache-rat-plugin is missing.
@ line 321, column 21
[WARNING] 'build.plugins.plugin.version' for org.apache.maven.plugins:maven-eclipse-plugin
is missing. @ line 368, column 21
[WARNING] 'reporting.plugins.plugin.version' for org.scala-tools:maven-scala-plugin is missing.
@ line 468, column 21
[WARNING] 'repositories.repository.layout' for Apache Repo uses the unsupported value 'legacy',
artifact resolution might fail. @ line 121, column 23
[WARNING] 
[WARNING] It is highly recommended to fix these problems because they threaten the stability
of your build.
[WARNING] 
[WARNING] For this reason, future Maven versions might no longer support building such malformed
projects.
[WARNING] 
[INFO]                                                                         
[INFO] ------------------------------------------------------------------------
[INFO] Building Apache Enterprise Social Messaging Environment (ESME) apache-esme-1.4
[INFO] ------------------------------------------------------------------------
Downloading: http://scala-tools.org/repo-releases/org/apache/rat/apache-rat-plugin/maven-metadata.xml
Downloading: http://scala-tools.org/repo-releases/org/mortbay/jetty/maven-jetty-plugin/maven-metadata.xml
Downloading: http://scala-tools.org/repo-releases/net/sf/alchim/yuicompressor-maven-plugin/maven-metadata.xml
Downloading: http://scala-tools.org/repo-releases/org/apache/maven/plugins/maven-eclipse-plugin/maven-metadata.xml
Downloading: http://scala-tools.org/repo-releases/org/mortbay/jetty/jetty/maven-metadata.xml
Downloading: http://repo2.maven.org/maven2/org/mortbay/jetty/jetty/maven-metadata.xml
Downloading: http://repo.compass-project.org/org/mortbay/jetty/jetty/maven-metadata.xml
Downloading: http://scala-tools.org/repo-snapshots/org/mortbay/jetty/jetty/maven-metadata.xml
Downloading: http://maven.twttr.com/org/mortbay/jetty/jetty/maven-metadata.xml
Downloading: http://repo1.maven.org/maven2/org/mortbay/jetty/jetty/maven-metadata.xml
Downloaded: http://repo2.maven.org/maven2/org/mortbay/jetty/jetty/maven-metadata.xml (3 KB
at 7.1 KB/sec)
Downloaded: http://repo1.maven.org/maven2/org/mortbay/jetty/jetty/maven-metadata.xml (3 KB
at 3.9 KB/sec)
[WARNING] Could not transfer metadata org.mortbay.jetty:jetty/maven-metadata.xml from/to Apache
Repo (http://people.apache.org/repo/m1-ibiblio-rsync-repository): No connector available to
access repository Apache Repo (http://people.apache.org/repo/m1-ibiblio-rsync-repository)
of type legacy using the available factories WagonRepositoryConnectorFactory
[INFO] 
[INFO] --- maven-clean-plugin:2.4.1:clean (default-clean) @ esme-server ---
log4j:WARN No appenders could be found for logger (org.apache.commons.beanutils.converters.BooleanConverter).
log4j:WARN Please initialize the log4j system properly.
[INFO] 
[INFO] --- maven-resources-plugin:2.4.3:resources (default-resources) @ esme-server ---
[WARNING] Using platform encoding (ANSI_X3.4-1968 actually) to copy filtered resources, i.e.
build is platform dependent!
[INFO] Copying 13 resources
[INFO] 
[INFO] --- yuicompressor-maven-plugin:0.7.1:compress (default) @ esme-server ---
[INFO] nb warnings: 0, nb errors: 0
[INFO] 
[INFO] --- maven-compiler-plugin:2.3.2:compile (default-compile) @ esme-server ---
[INFO] Nothing to compile - all classes are up to date
[INFO] 
[INFO] --- maven-scala-plugin:2.9:compile (default) @ esme-server ---
[INFO] suggestion: remove the scalaVersion from pom.xml
[ERROR] <https://builds.apache.org/job/ESME/ws/server/src/main/scala>
[ERROR] <https://builds.apache.org/job/ESME/ws/server/src/main/scala/../scala>
[INFO] Compiling 66 source files to /x1/jenkins/jenkins-slave/workspace/ESME/server/target/classes
[WARNING] /x1/jenkins/jenkins-slave/workspace/ESME/server/src/main/scala/org/apache/esme/model/UserAuth.scala:452:
warning: match is not exhaustive!
[WARNING] missing combination        Failure
[WARNING] missing combination   ParamFailure
[WARNING] 
[WARNING]         S.request match {
[WARNING]           ^
[WARNING] /x1/jenkins/jenkins-slave/workspace/ESME/server/src/main/scala/org/apache/esme/model/UserAuth.scala:538:
warning: match is not exhaustive!
[WARNING] missing combination        Failure
[WARNING] missing combination   ParamFailure
[WARNING] 
[WARNING]               user <- UserAuth.find(By(UserAuth.authKey, name),
[WARNING]                    ^
[WARNING] warning: there were 20 deprecation warnings; re-run with -deprecation for details
[WARNING] warning: there were 13 unchecked warnings; re-run with -unchecked for details
[WARNING] four warnings found
[INFO] [WARNING] Using platform encoding (ANSI_X3.4-1968 actually) to copy filtered resources,
i.e. build is platform dependent!
[INFO] skip non existing resourceDirectory <https://builds.apache.org/job/ESME/ws/server/src/test/resources>

[INFO] --- maven-resources-plugin:2.4.3:testResources (default-testResources) @ esme-server
---
[INFO] 
[INFO] --- maven-compiler-plugin:2.3.2:testCompile (default-testCompile) @ esme-server ---
[INFO] Nothing to compile - all classes are up to date
[INFO] [INFO] suggestion: remove the scalaVersion from pom.xml

[ERROR] <https://builds.apache.org/job/ESME/ws/server/src/test/scala>
[ERROR] <https://builds.apache.org/job/ESME/ws/server/src/test/scala/../scala>
[INFO] --- maven-scala-plugin:2.9:testCompile (default) @ esme-server ---
[INFO] Compiling 8 source files to /x1/jenkins/jenkins-slave/workspace/ESME/server/target/test-classes
[WARNING] /x1/jenkins/jenkins-slave/workspace/ESME/server/src/test/scala/org/apache/esme/JettySetup.scala:33:
error: WebAppContext is not a member of org.mortbay.jetty.webapp
[WARNING] import org.mortbay.jetty.webapp.WebAppContext
[WARNING]        ^
[WARNING] /x1/jenkins/jenkins-slave/workspace/ESME/server/src/test/scala/org/apache/esme/api/ApiTest.scala:32:
error: WebAppContext is not a member of org.mortbay.jetty.webapp
[WARNING] import org.mortbay.jetty.webapp.WebAppContext
[WARNING]        ^
[WARNING] /x1/jenkins/jenkins-slave/workspace/ESME/server/src/test/scala/org/apache/esme/JettySetup.scala:48:
error: not found: type WebAppContext
[WARNING]     val context = new WebAppContext()
[WARNING]                       ^
[WARNING] three errors found
[JENKINS] Archiving <https://builds.apache.org/job/ESME/ws/server/pom.xml> to /home/hudson/hudson/jobs/ESME/modules/org.apache.esme$esme-server/builds/2012-02-22_12-10-27/archive/org.apache.esme/esme-server/apache-esme-1.4/esme-server-apache-esme-1.4.pom
[INFO] ------------------------------------------------------------------------
[INFO] BUILD FAILURE
[INFO] ------------------------------------------------------------------------
[INFO] Total time: 54.064s
[INFO] Finished at: Wed Feb 22 12:11:24 UTC 2012
[INFO] Final Memory: 19M/76M
[INFO] ------------------------------------------------------------------------
Waiting for Jenkins to finish collecting data
mavenExecutionResult exceptions not empty
message : Failed to execute goal org.scala-tools:maven-scala-plugin:2.9:testCompile (default)
on project esme-server: command line returned non-zero value:1
cause : command line returned non-zero value:1
Stack trace : 
org.apache.maven.lifecycle.LifecycleExecutionException: Failed to execute goal org.scala-tools:maven-scala-plugin:2.9:testCompile
(default) on project esme-server: command line returned non-zero value:1
	at org.apache.maven.lifecycle.internal.MojoExecutor.execute(MojoExecutor.java:213)
	at org.apache.maven.lifecycle.internal.MojoExecutor.execute(MojoExecutor.java:153)
	at org.apache.maven.lifecycle.internal.MojoExecutor.execute(MojoExecutor.java:145)
	at org.apache.maven.lifecycle.internal.LifecycleModuleBuilder.buildProject(LifecycleModuleBuilder.java:84)
	at org.apache.maven.lifecycle.internal.LifecycleModuleBuilder.buildProject(LifecycleModuleBuilder.java:59)
	at org.apache.maven.lifecycle.internal.LifecycleStarter.singleThreadedBuild(LifecycleStarter.java:183)
	at org.apache.maven.lifecycle.internal.LifecycleStarter.execute(LifecycleStarter.java:161)
	at org.apache.maven.DefaultMaven.doExecute(DefaultMaven.java:319)
	at org.apache.maven.DefaultMaven.execute(DefaultMaven.java:156)
	at org.jvnet.hudson.maven3.launcher.Maven3Launcher.main(Maven3Launcher.java:79)
	at sun.reflect.NativeMethodAccessorImpl.invoke0(Native Method)
	at sun.reflect.NativeMethodAccessorImpl.invoke(NativeMethodAccessorImpl.java:39)
	at sun.reflect.DelegatingMethodAccessorImpl.invoke(DelegatingMethodAccessorImpl.java:25)
	at java.lang.reflect.Method.invoke(Method.java:597)
	at org.codehaus.plexus.classworlds.launcher.Launcher.launchStandard(Launcher.java:329)
	at org.codehaus.plexus.classworlds.launcher.Launcher.launch(Launcher.java:239)
	at org.jvnet.hudson.maven3.agent.Maven3Main.launch(Maven3Main.java:158)
	at hudson.maven.Maven3Builder.call(Maven3Builder.java:104)
	at hudson.maven.Maven3Builder.call(Maven3Builder.java:70)
	at hudson.remoting.UserRequest.perform(UserRequest.java:118)
	at hudson.remoting.UserRequest.perform(UserRequest.java:48)
	at hudson.remoting.Request$2.run(Request.java:287)
	at hudson.remoting.InterceptingExecutorService$1.call(InterceptingExecutorService.java:72)
	at java.util.concurrent.FutureTask$Sync.innerRun(FutureTask.java:303)
	at java.util.concurrent.FutureTask.run(FutureTask.java:138)
	at java.util.concurrent.ThreadPoolExecutor$Worker.runTask(ThreadPoolExecutor.java:886)
	at java.util.concurrent.ThreadPoolExecutor$Worker.run(ThreadPoolExecutor.java:908)
	at java.lang.Thread.run(Thread.java:662)
Caused by: org.apache.maven.plugin.MojoFailureException: command line returned non-zero value:1
	at org.scala_tools.maven.JavaCommand.run(JavaCommand.java:196)
	at org.scala_tools.maven.ScalaCompilerSupport.compile(ScalaCompilerSupport.java:124)
	at org.scala_tools.maven.ScalaCompilerSupport.doExecute(ScalaCompilerSupport.java:54)
	at org.scala_tools.maven.ScalaMojoSupport.execute(ScalaMojoSupport.java:208)
	at org.scala_tools.maven.ScalaCompilerSupport.execute(ScalaCompilerSupport.java:29)
	at org.scala_tools.maven.ScalaTestCompileMojo.execute(ScalaTestCompileMojo.java:58)
	at org.apache.maven.plugin.DefaultBuildPluginManager.executeMojo(DefaultBuildPluginManager.java:101)
	at org.apache.maven.lifecycle.internal.MojoExecutor.execute(MojoExecutor.java:209)
	... 27 more
channel stopped
[WARNINGS] Skipping publisher since build result is FAILURE


Mime
View raw message