esme-dev mailing list archives

Site index · List index
Message view « Date » · « Thread »
Top « Date » · « Thread »
From Ethan Jewett <esjew...@gmail.com>
Subject Re: Build failed in Jenkins: ESME #803
Date Sat, 17 Dec 2011 15:29:31 GMT
Looks to me like a Maven problem, since the stack trace starts with a Maven
function and not an ESME one. Hopefully it is better tomorrow :-)

Ethan

On Sat, Dec 17, 2011 at 3:38 PM, Richard Hirsch <hirsch.dick@gmail.com>wrote:

> Anyone know why the problem with the build is happening?
>
> D.
>
> ---------- Forwarded message ----------
> From: Apache Jenkins Server <jenkins@builds.apache.org>
> Date: Sat, Dec 17, 2011 at 1:12 PM
> Subject: Build failed in Jenkins: ESME #803
> To: dev@esme.apache.org
>
>
> See <https://builds.apache.org/job/ESME/803/>
>
> ------------------------------------------
> Started by timer
> Building remotely on ubuntu5
> Updating http://svn.apache.org/repos/asf/esme/trunk/server
> At revision 1215473
> no change for http://svn.apache.org/repos/asf/esme/trunk/server since
> the previous build
> Parsing POMs
> [server] $ /home/hudson/tools/java/latest1.6/bin/java -cp
>
> /home/jenkins/jenkins-slave/maven3-agent.jar:/home/hudson/tools/maven/latest/boot/plexus-classworlds-2.4.jar
> org.jvnet.hudson.maven3.agent.Maven3Main
> /home/hudson/tools/maven/latest /home/jenkins/jenkins-slave/slave.jar
> /home/jenkins/jenkins-slave/maven3-interceptor.jar 51202
> <===[JENKINS REMOTING CAPACITY]===>channel started
>   Executing Maven:  -B -f
> <https://builds.apache.org/job/ESME/ws/server/pom.xml> clean install
> [WARNING]
> [WARNING] Some problems were encountered while building the effective
> model for org.apache.esme:esme-server:war:apache-esme-1.4
> [WARNING] 'dependencies.dependency.(groupId:artifactId:type:classifier)'
> must be unique: junit:junit:jar -> version 3.8.1 vs 4.4 @ line 308,
> column 21
> [WARNING] 'build.plugins.plugin.version' for
> org.mortbay.jetty:maven-jetty-plugin is missing. @ line 344, column 21
> [WARNING] 'build.plugins.plugin.version' for
> net.sf.alchim:yuicompressor-maven-plugin is missing. @ line 352,
> column 21
> [WARNING] 'build.plugins.plugin.version' for
> org.apache.rat:apache-rat-plugin is missing. @ line 321, column 21
> [WARNING] 'build.plugins.plugin.version' for
> org.apache.maven.plugins:maven-eclipse-plugin is missing. @ line 368,
> column 21
> [WARNING] 'reporting.plugins.plugin.version' for
> org.scala-tools:maven-scala-plugin is missing. @ line 468, column 21
> [WARNING] 'repositories.repository.layout' for Apache Repo uses the
> unsupported value 'legacy', artifact resolution might fail. @ line
> 121, column 23
> [WARNING]
> [WARNING] It is highly recommended to fix these problems because they
> threaten the stability of your build.
> [WARNING]
> [WARNING] For this reason, future Maven versions might no longer
> support building such malformed projects.
> [WARNING]
> [INFO] Scanning for projects...
> [INFO]
> [INFO]
> ------------------------------------------------------------------------
> [INFO] Building Apache Enterprise Social Messaging Environment (ESME)
> apache-esme-1.4
> [INFO]
> ------------------------------------------------------------------------
> Downloading:
> http://scala-tools.org/repo-releases/org/apache/rat/apache-rat-plugin/maven-metadata.xml
> Downloading:
> http://scala-tools.org/repo-releases/org/mortbay/jetty/maven-jetty-plugin/maven-metadata.xml
> Downloading:
> http://scala-tools.org/repo-releases/net/sf/alchim/yuicompressor-maven-plugin/maven-metadata.xml
> Downloading:
> http://scala-tools.org/repo-releases/org/apache/maven/plugins/maven-eclipse-plugin/maven-metadata.xml
> Downloading:
> http://repo2.maven.org/maven2/org/mortbay/jetty/jetty/maven-metadata.xml
> Downloading:
> http://scala-tools.org/repo-snapshots/org/mortbay/jetty/jetty/maven-metadata.xml
> Downloading:
> http://repo.compass-project.org/org/mortbay/jetty/jetty/maven-metadata.xml
> Downloading:
> http://scala-tools.org/repo-releases/org/mortbay/jetty/jetty/maven-metadata.xml
> Downloading:
> http://maven.twttr.com/org/mortbay/jetty/jetty/maven-metadata.xml
> Downloading:
> http://repo1.maven.org/maven2/org/mortbay/jetty/jetty/maven-metadata.xml
> Downloaded:
> http://repo2.maven.org/maven2/org/mortbay/jetty/jetty/maven-metadata.xml
> (3 KB at 1.7 KB/sec)
> Downloaded:
> http://repo1.maven.org/maven2/org/mortbay/jetty/jetty/maven-metadata.xml
> (3 KB at 1.5 KB/sec)
> [WARNING] Could not transfer metadata
> org.mortbay.jetty:jetty/maven-metadata.xml from/to Apache Repo
> (http://people.apache.org/repo/m1-ibiblio-rsync-repository): No
> connector available to access repository Apache Repo
> (http://people.apache.org/repo/m1-ibiblio-rsync-repository) of type
> legacy using the available factories WagonRepositoryConnectorFactory
> Downloading:
> http://repo2.maven.org/maven2/org/mortbay/jetty/jetty/7.0.0.pre5/jetty-7.0.0.pre5.jar
> Downloading:
> http://repo2.maven.org/maven2/org/mortbay/jetty/jetty-util/7.0.0.pre5/jetty-util-7.0.0.pre5.jar
> Downloaded:
> http://repo2.maven.org/maven2/org/mortbay/jetty/jetty-util/7.0.0.pre5/jetty-util-7.0.0.pre5.jar
> (0 B at 0.0 KB/sec)
> Downloaded:
> http://repo2.maven.org/maven2/org/mortbay/jetty/jetty/7.0.0.pre5/jetty-7.0.0.pre5.jar
> (0 B at 0.0 KB/sec)
> [INFO]
> [INFO] --- maven-clean-plugin:2.4.1:clean (default-clean) @ esme-server ---
> [INFO] Deleting <https://builds.apache.org/job/ESME/ws/server/target>
> [INFO]
> [INFO] --- maven-resources-plugin:2.4.3:resources (default-resources)
> @ esme-server ---
> [WARNING] Using platform encoding (ANSI_X3.4-1968 actually) to copy
> filtered resources, i.e. build is platform dependent!
> [INFO] Copying 13 resources
> [INFO]
> [INFO] --- yuicompressor-maven-plugin:0.7.1:compress (default) @
> esme-server ---
> [INFO] nb warnings: 0, nb errors: 0
> [INFO]
> [INFO] --- maven-compiler-plugin:2.3.2:compile (default-compile) @
> esme-server ---
> [INFO] Nothing to compile - all classes are up to date
> [INFO]
> [INFO] --- maven-scala-plugin:2.9:compile (default) @ esme-server ---
> [INFO] suggestion: remove the scalaVersion from pom.xml
> [ERROR] <https://builds.apache.org/job/ESME/ws/server/src/main/scala>
> [ERROR] <
> https://builds.apache.org/job/ESME/ws/server/src/main/scala/../scala>
> [INFO] Compiling 66 source files to
> <https://builds.apache.org/job/ESME/ws/server/target/classes>
> [WARNING] <
> https://builds.apache.org/job/ESME/ws/server/src/main/scala/org/apache/esme/model/UserAuth.scala
> >:389:
> warning: match is not exhaustive!
> [WARNING] missing combination        Failure
> [WARNING] missing combination   ParamFailure
> [WARNING]
> [WARNING]         S.request match {
> [WARNING]           ^
> [WARNING] <
> https://builds.apache.org/job/ESME/ws/server/src/main/scala/org/apache/esme/model/UserAuth.scala
> >:473:
> warning: match is not exhaustive!
> [WARNING] missing combination        Failure
> [WARNING] missing combination   ParamFailure
> [WARNING]
> [WARNING]               user <- UserAuth.find(By(UserAuth.authKey, name),
> [WARNING]                    ^
> [WARNING] warning: there were 19 deprecation warnings; re-run with
> -deprecation for details
> [WARNING] warning: there were 13 unchecked warnings; re-run with
> -unchecked for details
> [WARNING] four warnings found
> [INFO] [WARNING] Using platform encoding (ANSI_X3.4-1968 actually) to
> copy filtered resources, i.e. build is platform dependent!
> [INFO] skip non existing resourceDirectory
> <https://builds.apache.org/job/ESME/ws/server/src/test/resources>
>
> [INFO] --- maven-resources-plugin:2.4.3:testResources
> (default-testResources) @ esme-server ---
> [INFO]
> [INFO] --- maven-compiler-plugin:2.3.2:testCompile
> (default-testCompile) @ esme-server ---
> [INFO] Nothing to compile - all classes are up to date
> [INFO] [INFO] suggestion: remove the scalaVersion from pom.xml
> [ERROR] <https://builds.apache.org/job/ESME/ws/server/src/test/scala>
> [ERROR] <
> https://builds.apache.org/job/ESME/ws/server/src/test/scala/../scala>
> [INFO] Compiling 8 source files to
> <https://builds.apache.org/job/ESME/ws/server/target/test-classes>
>
> [INFO] --- maven-scala-plugin:2.9:testCompile (default) @ esme-server ---
> [WARNING] <
> https://builds.apache.org/job/ESME/ws/server/src/test/scala/org/apache/esme/JettySetup.scala
> >:33:
> error: WebAppContext is not a member of org.mortbay.jetty.webapp
> [WARNING] import org.mortbay.jetty.webapp.WebAppContext
> [WARNING]        ^
> [WARNING] <
> https://builds.apache.org/job/ESME/ws/server/src/test/scala/org/apache/esme/api/ApiTest.scala
> >:32:
> error: WebAppContext is not a member of org.mortbay.jetty.webapp
> [WARNING] import org.mortbay.jetty.webapp.WebAppContext
> [WARNING]        ^
> [WARNING] <
> https://builds.apache.org/job/ESME/ws/server/src/test/scala/org/apache/esme/JettySetup.scala
> >:48:
> error: not found: type WebAppContext
> [WARNING]     val context = new WebAppContext()
> [WARNING]                       ^
> [WARNING] three errors found
> [JENKINS] Archiving
> <https://builds.apache.org/job/ESME/ws/server/pom.xml> to
>
> /home/hudson/hudson/jobs/ESME/modules/org.apache.esme$esme-server/builds/2011-12-17_12-10-19/archive/org.apache.esme/esme-server/apache-esme-1.4/esme-server-apache-esme-1.4.pom
> [INFO]
> ------------------------------------------------------------------------
> [INFO] BUILD FAILURE
> [INFO]
> ------------------------------------------------------------------------
> [INFO] Total time: 1:25.589s
> [INFO] Finished at: Sat Dec 17 12:11:56 UTC 2011
> [INFO] Final Memory: 19M/95M
> [INFO]
> ------------------------------------------------------------------------
> Waiting for Jenkins to finish collecting data
> mavenExecutionResult exceptions not empty
> message : Failed to execute goal
> org.scala-tools:maven-scala-plugin:2.9:testCompile (default) on
> project esme-server: command line returned non-zero value:1
> cause : command line returned non-zero value:1
> Stack trace :
> org.apache.maven.lifecycle.LifecycleExecutionException: Failed to
> execute goal org.scala-tools:maven-scala-plugin:2.9:testCompile
> (default) on project esme-server: command line returned non-zero
> value:1
>        at
> org.apache.maven.lifecycle.internal.MojoExecutor.execute(MojoExecutor.java:213)
>        at
> org.apache.maven.lifecycle.internal.MojoExecutor.execute(MojoExecutor.java:153)
>        at
> org.apache.maven.lifecycle.internal.MojoExecutor.execute(MojoExecutor.java:145)
>        at
> org.apache.maven.lifecycle.internal.LifecycleModuleBuilder.buildProject(LifecycleModuleBuilder.java:84)
>        at
> org.apache.maven.lifecycle.internal.LifecycleModuleBuilder.buildProject(LifecycleModuleBuilder.java:59)
>        at
> org.apache.maven.lifecycle.internal.LifecycleStarter.singleThreadedBuild(LifecycleStarter.java:183)
>        at
> org.apache.maven.lifecycle.internal.LifecycleStarter.execute(LifecycleStarter.java:161)
>        at org.apache.maven.DefaultMaven.doExecute(DefaultMaven.java:319)
>        at org.apache.maven.DefaultMaven.execute(DefaultMaven.java:156)
>        at
> org.jvnet.hudson.maven3.launcher.Maven3Launcher.main(Maven3Launcher.java:79)
>        at sun.reflect.NativeMethodAccessorImpl.invoke0(Native Method)
>        at
> sun.reflect.NativeMethodAccessorImpl.invoke(NativeMethodAccessorImpl.java:39)
>        at
> sun.reflect.DelegatingMethodAccessorImpl.invoke(DelegatingMethodAccessorImpl.java:25)
>        at java.lang.reflect.Method.invoke(Method.java:597)
>        at
> org.codehaus.plexus.classworlds.launcher.Launcher.launchStandard(Launcher.java:329)
>        at
> org.codehaus.plexus.classworlds.launcher.Launcher.launch(Launcher.java:239)
>        at
> org.jvnet.hudson.maven3.agent.Maven3Main.launch(Maven3Main.java:158)
>        at hudson.maven.Maven3Builder.call(Maven3Builder.java:122)
>        at hudson.maven.Maven3Builder.call(Maven3Builder.java:74)
>        at hudson.remoting.UserRequest.perform(UserRequest.java:118)
>        at hudson.remoting.UserRequest.perform(UserRequest.java:48)
>        at hudson.remoting.Request$2.run(Request.java:287)
>        at
> java.util.concurrent.Executors$RunnableAdapter.call(Executors.java:441)
>        at
> java.util.concurrent.FutureTask$Sync.innerRun(FutureTask.java:303)
>        at java.util.concurrent.FutureTask.run(FutureTask.java:138)
>        at
> java.util.concurrent.ThreadPoolExecutor$Worker.runTask(ThreadPoolExecutor.java:886)
>        at
> java.util.concurrent.ThreadPoolExecutor$Worker.run(ThreadPoolExecutor.java:908)
>        at java.lang.Thread.run(Thread.java:662)
> Caused by: org.apache.maven.plugin.MojoFailureException: command line
> returned non-zero value:1
>        at org.scala_tools.maven.JavaCommand.run(JavaCommand.java:196)
>        at
> org.scala_tools.maven.ScalaCompilerSupport.compile(ScalaCompilerSupport.java:124)
>        at
> org.scala_tools.maven.ScalaCompilerSupport.doExecute(ScalaCompilerSupport.java:54)
>        at
> org.scala_tools.maven.ScalaMojoSupport.execute(ScalaMojoSupport.java:208)
>        at
> org.scala_tools.maven.ScalaCompilerSupport.execute(ScalaCompilerSupport.java:29)
>        at
> org.scala_tools.maven.ScalaTestCompileMojo.execute(ScalaTestCompileMojo.java:58)
>        at
> org.apache.maven.plugin.DefaultBuildPluginManager.executeMojo(DefaultBuildPluginManager.java:101)
>        at
> org.apache.maven.lifecycle.internal.MojoExecutor.execute(MojoExecutor.java:209)
>        ... 27 more
> Sending e-mails to: dev@esme.apache.org
> channel stopped
> [WARNINGS] Skipping publisher since build result is FAILURE
>

Mime
  • Unnamed multipart/alternative (inline, None, 0 bytes)
View raw message