empire-dev mailing list archives

Site index · List index
Message view « Date » · « Thread »
Top « Date » · « Thread »
From Apache Hudson Server <hud...@hudson.zones.apache.org>
Subject Build failed in Hudson: Empire-DB snapshot #104
Date Sat, 30 Jan 2010 18:20:24 GMT
See <http://hudson.zones.apache.org/hudson/job/Empire-DB%20snapshot/104/changes>

Changes:

[francisdb] EMPIREDB-64
Initial version of the empire-db maven (codegen) plugin + example project

[francisdb] EMPIREDB-64
Initial version of the empire-db maven (codegen) plugin + example project

------------------------------------------
[...truncated 7559 lines...]
	at org.codehaus.classworlds.Launcher.mainWithExitCode(Launcher.java:430)
	at org.codehaus.classworlds.Launcher.main(Launcher.java:375)
Jan 30, 2010 6:24:37 PM org.apache.velocity.runtime.log.CommonsLogLogChute log
SEVERE: ResourceManager : unable to find resource 'src/main/resources/templates/BaseRecord.vm'
in any resource loader.
Jan 30, 2010 6:24:37 PM org.apache.empire.db.codegen.CodeGenWriter writeFile
SEVERE: Unable to find resource 'src/main/resources/templates/BaseRecord.vm'
org.apache.velocity.exception.ResourceNotFoundException: Unable to find resource 'src/main/resources/templates/BaseRecord.vm'
	at org.apache.velocity.runtime.resource.ResourceManagerImpl.loadResource(ResourceManagerImpl.java:483)
	at org.apache.velocity.runtime.resource.ResourceManagerImpl.getResource(ResourceManagerImpl.java:354)
	at org.apache.velocity.runtime.RuntimeInstance.getTemplate(RuntimeInstance.java:1400)
	at org.apache.velocity.runtime.RuntimeInstance.getTemplate(RuntimeInstance.java:1380)
	at org.apache.velocity.runtime.RuntimeSingleton.getTemplate(RuntimeSingleton.java:305)
	at org.apache.velocity.app.Velocity.getTemplate(Velocity.java:383)
	at org.apache.empire.db.codegen.CodeGenWriter.writeFile(CodeGenWriter.java:278)
	at org.apache.empire.db.codegen.CodeGenWriter.createBaseRecordClass(CodeGenWriter.java:248)
	at org.apache.empire.db.codegen.CodeGenWriter.generateCodeFiles(CodeGenWriter.java:128)
	at org.apache.empire.db.maven.CodeGenMojo.execute(CodeGenMojo.java:101)
	at org.apache.maven.plugin.DefaultPluginManager.executeMojo(DefaultPluginManager.java:490)
	at org.apache.maven.lifecycle.DefaultLifecycleExecutor.executeGoals(DefaultLifecycleExecutor.java:694)
	at org.apache.maven.lifecycle.DefaultLifecycleExecutor.executeGoalWithLifecycle(DefaultLifecycleExecutor.java:556)
	at org.apache.maven.lifecycle.DefaultLifecycleExecutor.executeGoal(DefaultLifecycleExecutor.java:535)
	at org.apache.maven.lifecycle.DefaultLifecycleExecutor.executeGoalAndHandleFailures(DefaultLifecycleExecutor.java:387)
	at org.apache.maven.lifecycle.DefaultLifecycleExecutor.executeTaskSegments(DefaultLifecycleExecutor.java:348)
	at org.apache.maven.lifecycle.DefaultLifecycleExecutor.execute(DefaultLifecycleExecutor.java:180)
	at org.apache.maven.DefaultMaven.doExecute(DefaultMaven.java:328)
	at org.apache.maven.DefaultMaven.execute(DefaultMaven.java:138)
	at org.apache.maven.cli.MavenCli.main(MavenCli.java:362)
	at org.apache.maven.cli.compat.CompatibleMain.main(CompatibleMain.java:60)
	at sun.reflect.NativeMethodAccessorImpl.invoke0(Native Method)
	at sun.reflect.NativeMethodAccessorImpl.invoke(NativeMethodAccessorImpl.java:39)
	at sun.reflect.DelegatingMethodAccessorImpl.invoke(DelegatingMethodAccessorImpl.java:25)
	at java.lang.reflect.Method.invoke(Method.java:592)
	at org.codehaus.classworlds.Launcher.launchEnhanced(Launcher.java:315)
	at org.codehaus.classworlds.Launcher.launch(Launcher.java:255)
	at org.codehaus.classworlds.Launcher.mainWithExitCode(Launcher.java:430)
	at org.codehaus.classworlds.Launcher.main(Launcher.java:375)
[INFO] Code successfully generated in: <http://hudson.zones.apache.org/hudson/job/Empire-DB%20snapshot/ws/trunk/empire-db-examples/empire-db-example-codegen/target/generated-sources/empiredb>
[INFO] [remote-resources:process {execution: default}]
[INFO] [resources:resources {execution: default-resources}]
[INFO] Using 'UTF-8' encoding to copy filtered resources.
[INFO] skip non existing resourceDirectory <http://hudson.zones.apache.org/hudson/job/Empire-DB%20snapshot/ws/trunk/empire-db-examples/empire-db-example-codegen/src/main/resources>
[INFO] Copying 4 resources
[INFO] [compiler:compile {execution: default-compile}]
[INFO] Nothing to compile - all classes are up to date
[INFO] [resources:testResources {execution: default-testResources}]
[INFO] Using 'UTF-8' encoding to copy filtered resources.
[INFO] skip non existing resourceDirectory <http://hudson.zones.apache.org/hudson/job/Empire-DB%20snapshot/ws/trunk/empire-db-examples/empire-db-example-codegen/src/test/resources>
[INFO] Copying 4 resources
[INFO] [compiler:testCompile {execution: default-testCompile}]
[INFO] Compiling 1 source file to <http://hudson.zones.apache.org/hudson/job/Empire-DB%20snapshot/ws/trunk/empire-db-examples/empire-db-example-codegen/target/test-classes>
[INFO] [surefire:test {execution: default-test}]
[INFO] Surefire report directory: <http://hudson.zones.apache.org/hudson/job/Empire-DB%20snapshot/ws/trunk/empire-db-examples/empire-db-example-codegen/target/surefire-reports>

-------------------------------------------------------
 T E S T S
-------------------------------------------------------
Running org.apache.empire.db.examples.codegen.ValidatePluginRunTest
Tests run: 1, Failures: 0, Errors: 0, Skipped: 0, Time elapsed: 0.029 sec

Results :

Tests run: 1, Failures: 0, Errors: 0, Skipped: 0

[INFO] [jar:jar {execution: default-jar}]
[INFO] Building jar: <http://hudson.zones.apache.org/hudson/job/Empire-DB%20snapshot/ws/trunk/empire-db-examples/empire-db-example-codegen/target/empire-db-example-codegen-2.0.6-incubating-SNAPSHOT.jar>
[INFO] Preparing source:jar
[WARNING] Removing: jar from forked lifecycle, to prevent recursive invocation.
[INFO] [enforcer:enforce {execution: enforce-versions}]
[INFO] [empire-db:codegen {execution: default}]
[INFO] Generating code for jdbc:hsqldb:file:hsqldb/sample;shutdown=true ...
Jan 30, 2010 6:24:39 PM org.apache.empire.db.codegen.CodeGenParser openJDBCConnection
INFO: Connecting to Database'jdbc:hsqldb:file:hsqldb/sample;shutdown=true' / User=sa
Jan 30, 2010 6:24:39 PM org.apache.empire.db.codegen.CodeGenParser openJDBCConnection
INFO: Connected successfully
Jan 30, 2010 6:24:39 PM org.apache.empire.db.codegen.CodeGenParser populateDatabase
WARNING: DatabaseMetaData.getTables() returned no tables or views! Please check parameters:
catalog=null/ schema=null/ pattern=null
Jan 30, 2010 6:24:39 PM org.apache.empire.db.codegen.util.DBUtil close
INFO: Closing database connection
Jan 30, 2010 6:24:39 PM org.apache.velocity.runtime.log.CommonsLogLogChute log
SEVERE: ResourceManager : unable to find resource 'src/main/resources/templates/Database.vm'
in any resource loader.
Jan 30, 2010 6:24:39 PM org.apache.empire.db.codegen.CodeGenWriter writeFile
SEVERE: Unable to find resource 'src/main/resources/templates/Database.vm'
org.apache.velocity.exception.ResourceNotFoundException: Unable to find resource 'src/main/resources/templates/Database.vm'
	at org.apache.velocity.runtime.resource.ResourceManagerImpl.loadResource(ResourceManagerImpl.java:483)
	at org.apache.velocity.runtime.resource.ResourceManagerImpl.getResource(ResourceManagerImpl.java:354)
	at org.apache.velocity.runtime.RuntimeInstance.getTemplate(RuntimeInstance.java:1400)
	at org.apache.velocity.runtime.RuntimeInstance.getTemplate(RuntimeInstance.java:1380)
	at org.apache.velocity.runtime.RuntimeSingleton.getTemplate(RuntimeSingleton.java:305)
	at org.apache.velocity.app.Velocity.getTemplate(Velocity.java:383)
	at org.apache.empire.db.codegen.CodeGenWriter.writeFile(CodeGenWriter.java:278)
	at org.apache.empire.db.codegen.CodeGenWriter.createDatabaseClass(CodeGenWriter.java:188)
	at org.apache.empire.db.codegen.CodeGenWriter.generateCodeFiles(CodeGenWriter.java:119)
	at org.apache.empire.db.maven.CodeGenMojo.execute(CodeGenMojo.java:101)
	at org.apache.maven.plugin.DefaultPluginManager.executeMojo(DefaultPluginManager.java:490)
	at org.apache.maven.lifecycle.DefaultLifecycleExecutor.executeGoals(DefaultLifecycleExecutor.java:694)
	at org.apache.maven.lifecycle.DefaultLifecycleExecutor.executeGoalWithLifecycle(DefaultLifecycleExecutor.java:556)
	at org.apache.maven.lifecycle.DefaultLifecycleExecutor.forkProjectLifecycle(DefaultLifecycleExecutor.java:1205)
	at org.apache.maven.lifecycle.DefaultLifecycleExecutor.forkLifecycle(DefaultLifecycleExecutor.java:1038)
	at org.apache.maven.lifecycle.DefaultLifecycleExecutor.executeGoals(DefaultLifecycleExecutor.java:643)
	at org.apache.maven.lifecycle.DefaultLifecycleExecutor.executeGoalWithLifecycle(DefaultLifecycleExecutor.java:556)
	at org.apache.maven.lifecycle.DefaultLifecycleExecutor.executeGoal(DefaultLifecycleExecutor.java:535)
	at org.apache.maven.lifecycle.DefaultLifecycleExecutor.executeGoalAndHandleFailures(DefaultLifecycleExecutor.java:387)
	at org.apache.maven.lifecycle.DefaultLifecycleExecutor.executeTaskSegments(DefaultLifecycleExecutor.java:348)
	at org.apache.maven.lifecycle.DefaultLifecycleExecutor.execute(DefaultLifecycleExecutor.java:180)
	at org.apache.maven.DefaultMaven.doExecute(DefaultMaven.java:328)
	at org.apache.maven.DefaultMaven.execute(DefaultMaven.java:138)
	at org.apache.maven.cli.MavenCli.main(MavenCli.java:362)
	at org.apache.maven.cli.compat.CompatibleMain.main(CompatibleMain.java:60)
	at sun.reflect.NativeMethodAccessorImpl.invoke0(Native Method)
	at sun.reflect.NativeMethodAccessorImpl.invoke(NativeMethodAccessorImpl.java:39)
	at sun.reflect.DelegatingMethodAccessorImpl.invoke(DelegatingMethodAccessorImpl.java:25)
	at java.lang.reflect.Method.invoke(Method.java:592)
	at org.codehaus.classworlds.Launcher.launchEnhanced(Launcher.java:315)
	at org.codehaus.classworlds.Launcher.launch(Launcher.java:255)
	at org.codehaus.classworlds.Launcher.mainWithExitCode(Launcher.java:430)
	at org.codehaus.classworlds.Launcher.main(Launcher.java:375)
Jan 30, 2010 6:24:39 PM org.apache.velocity.runtime.log.CommonsLogLogChute log
SEVERE: ResourceManager : unable to find resource 'src/main/resources/templates/BaseTable.vm'
in any resource loader.
Jan 30, 2010 6:24:39 PM org.apache.empire.db.codegen.CodeGenWriter writeFile
SEVERE: Unable to find resource 'src/main/resources/templates/BaseTable.vm'
org.apache.velocity.exception.ResourceNotFoundException: Unable to find resource 'src/main/resources/templates/BaseTable.vm'
	at org.apache.velocity.runtime.resource.ResourceManagerImpl.loadResource(ResourceManagerImpl.java:483)
	at org.apache.velocity.runtime.resource.ResourceManagerImpl.getResource(ResourceManagerImpl.java:354)
	at org.apache.velocity.runtime.RuntimeInstance.getTemplate(RuntimeInstance.java:1400)
	at org.apache.velocity.runtime.RuntimeInstance.getTemplate(RuntimeInstance.java:1380)
	at org.apache.velocity.runtime.RuntimeSingleton.getTemplate(RuntimeSingleton.java:305)
	at org.apache.velocity.app.Velocity.getTemplate(Velocity.java:383)
	at org.apache.empire.db.codegen.CodeGenWriter.writeFile(CodeGenWriter.java:278)
	at org.apache.empire.db.codegen.CodeGenWriter.createBaseTableClass(CodeGenWriter.java:197)
	at org.apache.empire.db.codegen.CodeGenWriter.generateCodeFiles(CodeGenWriter.java:122)
	at org.apache.empire.db.maven.CodeGenMojo.execute(CodeGenMojo.java:101)
	at org.apache.maven.plugin.DefaultPluginManager.executeMojo(DefaultPluginManager.java:490)
	at org.apache.maven.lifecycle.DefaultLifecycleExecutor.executeGoals(DefaultLifecycleExecutor.java:694)
	at org.apache.maven.lifecycle.DefaultLifecycleExecutor.executeGoalWithLifecycle(DefaultLifecycleExecutor.java:556)
	at org.apache.maven.lifecycle.DefaultLifecycleExecutor.forkProjectLifecycle(DefaultLifecycleExecutor.java:1205)
	at org.apache.maven.lifecycle.DefaultLifecycleExecutor.forkLifecycle(DefaultLifecycleExecutor.java:1038)
	at org.apache.maven.lifecycle.DefaultLifecycleExecutor.executeGoals(DefaultLifecycleExecutor.java:643)
	at org.apache.maven.lifecycle.DefaultLifecycleExecutor.executeGoalWithLifecycle(DefaultLifecycleExecutor.java:556)
	at org.apache.maven.lifecycle.DefaultLifecycleExecutor.executeGoal(DefaultLifecycleExecutor.java:535)
	at org.apache.maven.lifecycle.DefaultLifecycleExecutor.executeGoalAndHandleFailures(DefaultLifecycleExecutor.java:387)
	at org.apache.maven.lifecycle.DefaultLifecycleExecutor.executeTaskSegments(DefaultLifecycleExecutor.java:348)
	at org.apache.maven.lifecycle.DefaultLifecycleExecutor.execute(DefaultLifecycleExecutor.java:180)
	at org.apache.maven.DefaultMaven.doExecute(DefaultMaven.java:328)
	at org.apache.maven.DefaultMaven.execute(DefaultMaven.java:138)
	at org.apache.maven.cli.MavenCli.main(MavenCli.java:362)
	at org.apache.maven.cli.compat.CompatibleMain.main(CompatibleMain.java:60)
	at sun.reflect.NativeMethodAccessorImpl.invoke0(Native Method)
	at sun.reflect.NativeMethodAccessorImpl.invoke(NativeMethodAccessorImpl.java:39)
	at sun.reflect.DelegatingMethodAccessorImpl.invoke(DelegatingMethodAccessorImpl.java:25)
	at java.lang.reflect.Method.invoke(Method.java:592)
	at org.codehaus.classworlds.Launcher.launchEnhanced(Launcher.java:315)
	at org.codehaus.classworlds.Launcher.launch(Launcher.java:255)
	at org.codehaus.classworlds.Launcher.mainWithExitCode(Launcher.java:430)
	at org.codehaus.classworlds.Launcher.main(Launcher.java:375)
Jan 30, 2010 6:24:39 PM org.apache.velocity.runtime.log.CommonsLogLogChute log
SEVERE: ResourceManager : unable to find resource 'src/main/resources/templates/BaseView.vm'
in any resource loader.
Jan 30, 2010 6:24:39 PM org.apache.empire.db.codegen.CodeGenWriter writeFile
SEVERE: Unable to find resource 'src/main/resources/templates/BaseView.vm'
org.apache.velocity.exception.ResourceNotFoundException: Unable to find resource 'src/main/resources/templates/BaseView.vm'
	at org.apache.velocity.runtime.resource.ResourceManagerImpl.loadResource(ResourceManagerImpl.java:483)
	at org.apache.velocity.runtime.resource.ResourceManagerImpl.getResource(ResourceManagerImpl.java:354)
	at org.apache.velocity.runtime.RuntimeInstance.getTemplate(RuntimeInstance.java:1400)
	at org.apache.velocity.runtime.RuntimeInstance.getTemplate(RuntimeInstance.java:1380)
	at org.apache.velocity.runtime.RuntimeSingleton.getTemplate(RuntimeSingleton.java:305)
	at org.apache.velocity.app.Velocity.getTemplate(Velocity.java:383)
	at org.apache.empire.db.codegen.CodeGenWriter.writeFile(CodeGenWriter.java:278)
	at org.apache.empire.db.codegen.CodeGenWriter.createBaseViewClass(CodeGenWriter.java:221)
	at org.apache.empire.db.codegen.CodeGenWriter.generateCodeFiles(CodeGenWriter.java:125)
	at org.apache.empire.db.maven.CodeGenMojo.execute(CodeGenMojo.java:101)
	at org.apache.maven.plugin.DefaultPluginManager.executeMojo(DefaultPluginManager.java:490)
	at org.apache.maven.lifecycle.DefaultLifecycleExecutor.executeGoals(DefaultLifecycleExecutor.java:694)
	at org.apache.maven.lifecycle.DefaultLifecycleExecutor.executeGoalWithLifecycle(DefaultLifecycleExecutor.java:556)
	at org.apache.maven.lifecycle.DefaultLifecycleExecutor.forkProjectLifecycle(DefaultLifecycleExecutor.java:1205)
	at org.apache.maven.lifecycle.DefaultLifecycleExecutor.forkLifecycle(DefaultLifecycleExecutor.java:1038)
	at org.apache.maven.lifecycle.DefaultLifecycleExecutor.executeGoals(DefaultLifecycleExecutor.java:643)
	at org.apache.maven.lifecycle.DefaultLifecycleExecutor.executeGoalWithLifecycle(DefaultLifecycleExecutor.java:556)
	at org.apache.maven.lifecycle.DefaultLifecycleExecutor.executeGoal(DefaultLifecycleExecutor.java:535)
	at org.apache.maven.lifecycle.DefaultLifecycleExecutor.executeGoalAndHandleFailures(DefaultLifecycleExecutor.java:387)
	at org.apache.maven.lifecycle.DefaultLifecycleExecutor.executeTaskSegments(DefaultLifecycleExecutor.java:348)
	at org.apache.maven.lifecycle.DefaultLifecycleExecutor.execute(DefaultLifecycleExecutor.java:180)
	at org.apache.maven.DefaultMaven.doExecute(DefaultMaven.java:328)
	at org.apache.maven.DefaultMaven.execute(DefaultMaven.java:138)
	at org.apache.maven.cli.MavenCli.main(MavenCli.java:362)
	at org.apache.maven.cli.compat.CompatibleMain.main(CompatibleMain.java:60)
	at sun.reflect.NativeMethodAccessorImpl.invoke0(Native Method)
	at sun.reflect.NativeMethodAccessorImpl.invoke(NativeMethodAccessorImpl.java:39)
	at sun.reflect.DelegatingMethodAccessorImpl.invoke(DelegatingMethodAccessorImpl.java:25)
	at java.lang.reflect.Method.invoke(Method.java:592)
	at org.codehaus.classworlds.Launcher.launchEnhanced(Launcher.java:315)
	at org.codehaus.classworlds.Launcher.launch(Launcher.java:255)
	at org.codehaus.classworlds.Launcher.mainWithExitCode(Launcher.java:430)
	at org.codehaus.classworlds.Launcher.main(Launcher.java:375)
Jan 30, 2010 6:24:39 PM org.apache.velocity.runtime.log.CommonsLogLogChute log
SEVERE: ResourceManager : unable to find resource 'src/main/resources/templates/BaseRecord.vm'
in any resource loader.
Jan 30, 2010 6:24:39 PM org.apache.empire.db.codegen.CodeGenWriter writeFile
SEVERE: Unable to find resource 'src/main/resources/templates/BaseRecord.vm'
org.apache.velocity.exception.ResourceNotFoundException: Unable to find resource 'src/main/resources/templates/BaseRecord.vm'
	at org.apache.velocity.runtime.resource.ResourceManagerImpl.loadResource(ResourceManagerImpl.java:483)
	at org.apache.velocity.runtime.resource.ResourceManagerImpl.getResource(ResourceManagerImpl.java:354)
	at org.apache.velocity.runtime.RuntimeInstance.getTemplate(RuntimeInstance.java:1400)
	at org.apache.velocity.runtime.RuntimeInstance.getTemplate(RuntimeInstance.java:1380)
	at org.apache.velocity.runtime.RuntimeSingleton.getTemplate(RuntimeSingleton.java:305)
	at org.apache.velocity.app.Velocity.getTemplate(Velocity.java:383)
	at org.apache.empire.db.codegen.CodeGenWriter.writeFile(CodeGenWriter.java:278)
	at org.apache.empire.db.codegen.CodeGenWriter.createBaseRecordClass(CodeGenWriter.java:248)
	at org.apache.empire.db.codegen.CodeGenWriter.generateCodeFiles(CodeGenWriter.java:128)
	at org.apache.empire.db.maven.CodeGenMojo.execute(CodeGenMojo.java:101)
	at org.apache.maven.plugin.DefaultPluginManager.executeMojo(DefaultPluginManager.java:490)
	at org.apache.maven.lifecycle.DefaultLifecycleExecutor.executeGoals(DefaultLifecycleExecutor.java:694)
	at org.apache.maven.lifecycle.DefaultLifecycleExecutor.executeGoalWithLifecycle(DefaultLifecycleExecutor.java:556)
	at org.apache.maven.lifecycle.DefaultLifecycleExecutor.forkProjectLifecycle(DefaultLifecycleExecutor.java:1205)
	at org.apache.maven.lifecycle.DefaultLifecycleExecutor.forkLifecycle(DefaultLifecycleExecutor.java:1038)
	at org.apache.maven.lifecycle.DefaultLifecycleExecutor.executeGoals(DefaultLifecycleExecutor.java:643)
	at org.apache.maven.lifecycle.DefaultLifecycleExecutor.executeGoalWithLifecycle(DefaultLifecycleExecutor.java:556)
	at org.apache.maven.lifecycle.DefaultLifecycleExecutor.executeGoal(DefaultLifecycleExecutor.java:535)
	at org.apache.maven.lifecycle.DefaultLifecycleExecutor.executeGoalAndHandleFailures(DefaultLifecycleExecutor.java:387)
	at org.apache.maven.lifecycle.DefaultLifecycleExecutor.executeTaskSegments(DefaultLifecycleExecutor.java:348)
	at org.apache.maven.lifecycle.DefaultLifecycleExecutor.execute(DefaultLifecycleExecutor.java:180)
	at org.apache.maven.DefaultMaven.doExecute(DefaultMaven.java:328)
	at org.apache.maven.DefaultMaven.execute(DefaultMaven.java:138)
	at org.apache.maven.cli.MavenCli.main(MavenCli.java:362)
	at org.apache.maven.cli.compat.CompatibleMain.main(CompatibleMain.java:60)
	at sun.reflect.NativeMethodAccessorImpl.invoke0(Native Method)
	at sun.reflect.NativeMethodAccessorImpl.invoke(NativeMethodAccessorImpl.java:39)
	at sun.reflect.DelegatingMethodAccessorImpl.invoke(DelegatingMethodAccessorImpl.java:25)
	at java.lang.reflect.Method.invoke(Method.java:592)
	at org.codehaus.classworlds.Launcher.launchEnhanced(Launcher.java:315)
	at org.codehaus.classworlds.Launcher.launch(Launcher.java:255)
	at org.codehaus.classworlds.Launcher.mainWithExitCode(Launcher.java:430)
	at org.codehaus.classworlds.Launcher.main(Launcher.java:375)
[INFO] Code successfully generated in: <http://hudson.zones.apache.org/hudson/job/Empire-DB%20snapshot/ws/trunk/empire-db-examples/empire-db-example-codegen/target/generated-sources/empiredb>
[INFO] [source:jar {execution: attach-sources}]
[INFO] Building jar: <http://hudson.zones.apache.org/hudson/job/Empire-DB%20snapshot/ws/trunk/empire-db-examples/empire-db-example-codegen/target/empire-db-example-codegen-2.0.6-incubating-SNAPSHOT-sources.jar>
[INFO] [javadoc:jar {execution: attach-javadocs}]
[INFO] [license:check {execution: default}]
[INFO] Checking licenses...
[INFO] Missing header in: <http://hudson.zones.apache.org/hudson/job/Empire-DB%20snapshot/ws/trunk/empire-db-examples/empire-db-example-codegen/src/test/java/org/apache/empire/db/examples/codegen/ValidatePluginRunTest.java>
[INFO] ------------------------------------------------------------------------
[ERROR] BUILD ERROR
[INFO] ------------------------------------------------------------------------
[INFO] Some files do not have the expected license header
[INFO] ------------------------------------------------------------------------
[INFO] For more information, run Maven with the -e switch
[INFO] ------------------------------------------------------------------------
[INFO] Total time: 2 minutes 46 seconds
[INFO] Finished at: Sat Jan 30 18:24:39 UTC 2010
[INFO] Final Memory: 63M/173M
[INFO] ------------------------------------------------------------------------
Recording test results


Mime
View raw message