drill-issues mailing list archives

Site index · List index
Message view « Date » · « Thread »
Top « Date » · « Thread »
From "Arina Ielchiieva (JIRA)" <j...@apache.org>
Subject [jira] [Updated] (DRILL-5730) Fix Unit Test failures on JDK 8 And Some JDK 7 versions
Date Fri, 26 Jan 2018 10:13:00 GMT

     [ https://issues.apache.org/jira/browse/DRILL-5730?page=com.atlassian.jira.plugin.system.issuetabpanels:all-tabpanel
]

Arina Ielchiieva updated DRILL-5730:
------------------------------------
    Affects Version/s: 1.12.0

> Fix Unit Test failures on JDK 8 And Some JDK 7 versions
> -------------------------------------------------------
>
>                 Key: DRILL-5730
>                 URL: https://issues.apache.org/jira/browse/DRILL-5730
>             Project: Apache Drill
>          Issue Type: Bug
>    Affects Versions: 1.12.0
>            Reporter: Timothy Farkas
>            Assignee: Timothy Farkas
>            Priority: Major
>              Labels: ready-to-commit
>             Fix For: 1.13.0
>
>
> Tests fail on JDK 8 and oracle JDK 7 on my mac
> Failed tests: 
>   TestMetadataProvider.tables:153 expected:<OK> but was:<FAILED>
>   TestMetadataProvider.tablesWithTableNameFilter:212 expected:<OK> but was:<FAILED>
>   TestMetadataProvider.tablesWithSystemTableFilter:187 expected:<OK> but was:<FAILED>
>   TestMetadataProvider.tablesWithTableFilter:176 expected:<OK> but was:<FAILED>
> Tests in error: 
>   TestInfoSchema.selectFromAllTables » UserRemote SYSTEM ERROR: URISyntaxExcepti...
>   TestCustomUserAuthenticator.positiveUserAuth » UserRemote SYSTEM ERROR: URISyn...
>   TestCustomUserAuthenticator.positiveUserAuthAfterNegativeUserAuth » UserRemote
>   TestViewSupport.infoSchemaWithView:350->BaseTestQuery.testRunAndReturn:344 » Rpc
>   TestParquetScan.testSuccessFile:58->BaseTestQuery.testRunAndReturn:344 » Rpc o...



--
This message was sent by Atlassian JIRA
(v7.6.3#76005)

Mime
View raw message