drill-issues mailing list archives

Site index · List index
Message view « Date » · « Thread »
Top « Date » · « Thread »
From "ASF GitHub Bot (JIRA)" <j...@apache.org>
Subject [jira] [Commented] (DRILL-5730) Fix Unit Test failures on JDK 8 And Some JDK 7 versions
Date Thu, 18 Jan 2018 05:18:05 GMT

    [ https://issues.apache.org/jira/browse/DRILL-5730?page=com.atlassian.jira.plugin.system.issuetabpanels:comment-tabpanel&focusedCommentId=16330038#comment-16330038
] 

ASF GitHub Bot commented on DRILL-5730:
---------------------------------------

Github user paul-rogers commented on a diff in the pull request:

    https://github.com/apache/drill/pull/1045#discussion_r162251030
  
    --- Diff: exec/java-exec/src/test/java/org/apache/drill/test/OperatorFixture.java ---
    @@ -86,37 +117,35 @@
      * <li>Multiple threads of execution.</li>
      * </ul>
      */
    -
     public class OperatorFixture extends BaseFixture implements AutoCloseable {
     
    +  public OperatorContext operatorContext(PhysicalOperator config) {
    +    return new MockOperatorContext(context, allocator(), config);
    +  }
    +
       /**
        * Builds an operator fixture based on a set of config options and system/session
        * options.
        */
    -
    -  public static class OperatorFixtureBuilder
    +  public static class Builder
    --- End diff --
    
    Your PR is accidentally undoing a name change from a prior commit. Please check if we
have any other collisions in this or related files.


> Fix Unit Test failures on JDK 8 And Some JDK 7 versions
> -------------------------------------------------------
>
>                 Key: DRILL-5730
>                 URL: https://issues.apache.org/jira/browse/DRILL-5730
>             Project: Apache Drill
>          Issue Type: Bug
>            Reporter: Timothy Farkas
>            Assignee: Timothy Farkas
>            Priority: Major
>
> Tests fail on JDK 8 and oracle JDK 7 on my mac
> Failed tests: 
>   TestMetadataProvider.tables:153 expected:<OK> but was:<FAILED>
>   TestMetadataProvider.tablesWithTableNameFilter:212 expected:<OK> but was:<FAILED>
>   TestMetadataProvider.tablesWithSystemTableFilter:187 expected:<OK> but was:<FAILED>
>   TestMetadataProvider.tablesWithTableFilter:176 expected:<OK> but was:<FAILED>
> Tests in error: 
>   TestInfoSchema.selectFromAllTables » UserRemote SYSTEM ERROR: URISyntaxExcepti...
>   TestCustomUserAuthenticator.positiveUserAuth » UserRemote SYSTEM ERROR: URISyn...
>   TestCustomUserAuthenticator.positiveUserAuthAfterNegativeUserAuth » UserRemote
>   TestViewSupport.infoSchemaWithView:350->BaseTestQuery.testRunAndReturn:344 » Rpc
>   TestParquetScan.testSuccessFile:58->BaseTestQuery.testRunAndReturn:344 » Rpc o...



--
This message was sent by Atlassian JIRA
(v7.6.3#76005)

Mime
View raw message