drill-issues mailing list archives

Site index · List index
Message view « Date » · « Thread »
Top « Date » · « Thread »
From "ASF GitHub Bot (JIRA)" <j...@apache.org>
Subject [jira] [Commented] (DRILL-5730) Fix Unit Test failures on JDK 8 And Some JDK 7 versions
Date Thu, 18 Jan 2018 05:18:05 GMT

    [ https://issues.apache.org/jira/browse/DRILL-5730?page=com.atlassian.jira.plugin.system.issuetabpanels:comment-tabpanel&focusedCommentId=16330027#comment-16330027
] 

ASF GitHub Bot commented on DRILL-5730:
---------------------------------------

Github user paul-rogers commented on a diff in the pull request:

    https://github.com/apache/drill/pull/1045#discussion_r162229362
  
    --- Diff: contrib/storage-hive/core/src/main/java/org/apache/drill/exec/store/hive/HiveUtilities.java
---
    @@ -288,7 +288,7 @@ public static void populateVector(final ValueVector vector, final
DrillBuf manag
         }
       }
     
    -  public static MajorType getMajorTypeFromHiveTypeInfo(final TypeInfo typeInfo, final
OptionManager options) {
    +  public static MajorType getMajorTypeFromHiveTypeInfo(final TypeInfo typeInfo, final
OptionSet options) {
    --- End diff --
    
    Note that DRILL-6049 removes OptionSet in favor of OptionManager. (Thanks to the work
you and Jyothsna did, we can now use that class in tests.)


> Fix Unit Test failures on JDK 8 And Some JDK 7 versions
> -------------------------------------------------------
>
>                 Key: DRILL-5730
>                 URL: https://issues.apache.org/jira/browse/DRILL-5730
>             Project: Apache Drill
>          Issue Type: Bug
>            Reporter: Timothy Farkas
>            Assignee: Timothy Farkas
>            Priority: Major
>
> Tests fail on JDK 8 and oracle JDK 7 on my mac
> Failed tests: 
>   TestMetadataProvider.tables:153 expected:<OK> but was:<FAILED>
>   TestMetadataProvider.tablesWithTableNameFilter:212 expected:<OK> but was:<FAILED>
>   TestMetadataProvider.tablesWithSystemTableFilter:187 expected:<OK> but was:<FAILED>
>   TestMetadataProvider.tablesWithTableFilter:176 expected:<OK> but was:<FAILED>
> Tests in error: 
>   TestInfoSchema.selectFromAllTables » UserRemote SYSTEM ERROR: URISyntaxExcepti...
>   TestCustomUserAuthenticator.positiveUserAuth » UserRemote SYSTEM ERROR: URISyn...
>   TestCustomUserAuthenticator.positiveUserAuthAfterNegativeUserAuth » UserRemote
>   TestViewSupport.infoSchemaWithView:350->BaseTestQuery.testRunAndReturn:344 » Rpc
>   TestParquetScan.testSuccessFile:58->BaseTestQuery.testRunAndReturn:344 » Rpc o...



--
This message was sent by Atlassian JIRA
(v7.6.3#76005)

Mime
View raw message