drill-issues mailing list archives

Site index · List index
Message view « Date » · « Thread »
Top « Date » · « Thread »
From "ASF GitHub Bot (JIRA)" <j...@apache.org>
Subject [jira] [Commented] (DRILL-5730) Fix Unit Test failures on JDK 8 And Some JDK 7 versions
Date Mon, 11 Dec 2017 20:48:03 GMT

    [ https://issues.apache.org/jira/browse/DRILL-5730?page=com.atlassian.jira.plugin.system.issuetabpanels:comment-tabpanel&focusedCommentId=16286535#comment-16286535
] 

ASF GitHub Bot commented on DRILL-5730:
---------------------------------------

Github user paul-rogers commented on a diff in the pull request:

    https://github.com/apache/drill/pull/1045#discussion_r156186475
  
    --- Diff: exec/java-exec/src/main/java/org/apache/drill/exec/ops/BaseOperatorContext.java
---
    @@ -161,16 +163,13 @@ public void close() {
         }
         try {
           if (fs != null) {
    -        fs.close();
    -        fs = null;
    +          fs.close();
    --- End diff --
    
    Don't we like two space indentations?


> Fix Unit Test failures on JDK 8 And Some JDK 7 versions
> -------------------------------------------------------
>
>                 Key: DRILL-5730
>                 URL: https://issues.apache.org/jira/browse/DRILL-5730
>             Project: Apache Drill
>          Issue Type: Bug
>            Reporter: Timothy Farkas
>            Assignee: Timothy Farkas
>
> Tests fail on JDK 8 and oracle JDK 7 on my mac
> Failed tests: 
>   TestMetadataProvider.tables:153 expected:<OK> but was:<FAILED>
>   TestMetadataProvider.tablesWithTableNameFilter:212 expected:<OK> but was:<FAILED>
>   TestMetadataProvider.tablesWithSystemTableFilter:187 expected:<OK> but was:<FAILED>
>   TestMetadataProvider.tablesWithTableFilter:176 expected:<OK> but was:<FAILED>
> Tests in error: 
>   TestInfoSchema.selectFromAllTables » UserRemote SYSTEM ERROR: URISyntaxExcepti...
>   TestCustomUserAuthenticator.positiveUserAuth » UserRemote SYSTEM ERROR: URISyn...
>   TestCustomUserAuthenticator.positiveUserAuthAfterNegativeUserAuth » UserRemote
>   TestViewSupport.infoSchemaWithView:350->BaseTestQuery.testRunAndReturn:344 » Rpc
>   TestParquetScan.testSuccessFile:58->BaseTestQuery.testRunAndReturn:344 » Rpc o...



--
This message was sent by Atlassian JIRA
(v6.4.14#64029)

Mime
View raw message