drill-issues mailing list archives

Site index · List index
Message view « Date » · « Thread »
Top « Date » · « Thread »
From "Timothy Farkas (JIRA)" <j...@apache.org>
Subject [jira] [Updated] (DRILL-5730) Fix Unit Test failures on JDK 8 And Some JDK 7 versions
Date Wed, 22 Nov 2017 00:54:00 GMT

     [ https://issues.apache.org/jira/browse/DRILL-5730?page=com.atlassian.jira.plugin.system.issuetabpanels:all-tabpanel
]

Timothy Farkas updated DRILL-5730:
----------------------------------
    Reviewer: Paul Rogers

> Fix Unit Test failures on JDK 8 And Some JDK 7 versions
> -------------------------------------------------------
>
>                 Key: DRILL-5730
>                 URL: https://issues.apache.org/jira/browse/DRILL-5730
>             Project: Apache Drill
>          Issue Type: Bug
>            Reporter: Timothy Farkas
>            Assignee: Timothy Farkas
>
> Tests fail on JDK 8 and oracle JDK 7 on my mac
> Failed tests: 
>   TestMetadataProvider.tables:153 expected:<OK> but was:<FAILED>
>   TestMetadataProvider.tablesWithTableNameFilter:212 expected:<OK> but was:<FAILED>
>   TestMetadataProvider.tablesWithSystemTableFilter:187 expected:<OK> but was:<FAILED>
>   TestMetadataProvider.tablesWithTableFilter:176 expected:<OK> but was:<FAILED>
> Tests in error: 
>   TestInfoSchema.selectFromAllTables » UserRemote SYSTEM ERROR: URISyntaxExcepti...
>   TestCustomUserAuthenticator.positiveUserAuth » UserRemote SYSTEM ERROR: URISyn...
>   TestCustomUserAuthenticator.positiveUserAuthAfterNegativeUserAuth » UserRemote
>   TestViewSupport.infoSchemaWithView:350->BaseTestQuery.testRunAndReturn:344 » Rpc
>   TestParquetScan.testSuccessFile:58->BaseTestQuery.testRunAndReturn:344 » Rpc o...



--
This message was sent by Atlassian JIRA
(v6.4.14#64029)

Mime
View raw message