drill-dev mailing list archives

Site index · List index
Message view « Date » · « Thread »
Top « Date » · « Thread »
From Apache Jenkins Server <jenk...@builds.apache.org>
Subject Build failed in Jenkins: drill-scm #895
Date Wed, 11 Oct 2017 22:02:08 GMT
See <https://builds.apache.org/job/drill-scm/895/display/redirect?page=changes>

Changes:

[progers] DRILL-5830: Resolve regressions to MapR DB from DRILL-5546

[progers] DRILL-5775: Select * query on a maprdb binary table fails

------------------------------------------
[...truncated 159.25 KB...]
[INFO] --- maven-site-plugin:3.3:attach-descriptor (attach-descriptor) @ drill-kudu-storage
---
[INFO] 
[INFO] --- maven-jar-plugin:2.4:test-jar (default) @ drill-kudu-storage ---
[INFO] Building jar: <https://builds.apache.org/job/drill-scm/ws/contrib/storage-kudu/target/drill-kudu-storage-1.12.0-SNAPSHOT-tests.jar>
[INFO] 
[INFO] --- maven-checkstyle-plugin:2.12.1:check (checkstyle-validation) @ drill-kudu-storage
---
[INFO] Starting audit...
Audit done.

[INFO] 
[INFO] --- maven-enforcer-plugin:1.3.1:enforce (avoid_bad_dependencies) @ drill-kudu-storage
---
[INFO] 
[INFO] --- maven-install-plugin:2.5.1:install (default-install) @ drill-kudu-storage ---
[INFO] Installing <https://builds.apache.org/job/drill-scm/ws/contrib/storage-kudu/target/drill-kudu-storage-1.12.0-SNAPSHOT.jar>
to /home/jenkins/.m2/repository/org/apache/drill/contrib/drill-kudu-storage/1.12.0-SNAPSHOT/drill-kudu-storage-1.12.0-SNAPSHOT.jar
[INFO] Installing <https://builds.apache.org/job/drill-scm/ws/contrib/storage-kudu/pom.xml>
to /home/jenkins/.m2/repository/org/apache/drill/contrib/drill-kudu-storage/1.12.0-SNAPSHOT/drill-kudu-storage-1.12.0-SNAPSHOT.pom
[INFO] Installing <https://builds.apache.org/job/drill-scm/ws/contrib/storage-kudu/target/drill-kudu-storage-1.12.0-SNAPSHOT-tests.jar>
to /home/jenkins/.m2/repository/org/apache/drill/contrib/drill-kudu-storage/1.12.0-SNAPSHOT/drill-kudu-storage-1.12.0-SNAPSHOT-tests.jar
[INFO]                                                                         
[INFO] ------------------------------------------------------------------------
[INFO] Building contrib/mongo-storage-plugin 1.12.0-SNAPSHOT
[INFO] ------------------------------------------------------------------------
[INFO] 
[INFO] --- maven-clean-plugin:2.5:clean (default-clean) @ drill-mongo-storage ---
[INFO] Deleting <https://builds.apache.org/job/drill-scm/ws/contrib/storage-mongo/target>
[INFO] 
[INFO] --- apache-rat-plugin:0.12:check (rat-checks) @ drill-mongo-storage ---
[INFO] Enabled default license matchers.
[INFO] Will parse SCM ignores for exclusions...
[INFO] Finished adding exclusions from SCM ignore files.
[INFO] 61 implicit excludes (use -debug for more details).
[INFO] Exclude: **/*.log
[INFO] Exclude: **/*.css
[INFO] Exclude: **/*.js
[INFO] Exclude: **/*.md
[INFO] Exclude: **/*.eps
[INFO] Exclude: **/*.json
[INFO] Exclude: **/*.seq
[INFO] Exclude: **/*.parquet
[INFO] Exclude: **/*.sql
[INFO] Exclude: **/git.properties
[INFO] Exclude: **/*.csv
[INFO] Exclude: **/*.csvh
[INFO] Exclude: **/*.csvh-test
[INFO] Exclude: **/*.tsv
[INFO] Exclude: **/*.txt
[INFO] Exclude: **/*.ssv
[INFO] Exclude: **/drill-*.conf
[INFO] Exclude: **/.buildpath
[INFO] Exclude: **/*.proto
[INFO] Exclude: **/*.fmpp
[INFO] Exclude: **/target/**
[INFO] Exclude: **/*.iml
[INFO] Exclude: **/.idea/**
[INFO] Exclude: **/*.tdd
[INFO] Exclude: **/*.project
[INFO] Exclude: **/TAGS
[INFO] Exclude: **/*.checkstyle
[INFO] Exclude: **/.classpath
[INFO] Exclude: **/.settings/**
[INFO] Exclude: .*/**
[INFO] Exclude: **/*.patch
[INFO] Exclude: **/*.pb.cc
[INFO] Exclude: **/*.pb.h
[INFO] Exclude: **/*.linux
[INFO] Exclude: **/client/build/**
[INFO] Exclude: **/cmake_install.cmake
[INFO] Exclude: **/*.tbl
[INFO] Exclude: **/*.httpd
[INFO] Exclude: **/*.autotools
[INFO] Exclude: **/*.cproject
[INFO] Exclude: **/*.drill
[INFO] Exclude: dependency-reduced-pom.xml
[INFO] 29 resources included (use -debug for more details)
[INFO] Rat check: Summary over all files. Unapproved: 0, unknown: 0, generated: 0, approved:
29 licenses.
[INFO] 
[INFO] --- git-commit-id-plugin:2.1.9:revision (for-jars) @ drill-mongo-storage ---
[INFO] 
[INFO] --- maven-remote-resources-plugin:1.5:process (default) @ drill-mongo-storage ---
[INFO] 
[INFO] --- maven-resources-plugin:2.6:resources (default-resources) @ drill-mongo-storage
---
[INFO] Using 'UTF-8' encoding to copy filtered resources.
[INFO] Copying 2 resources
[INFO] Copying 3 resources
[INFO] 
[INFO] --- maven-compiler-plugin:3.2:compile (default-compile) @ drill-mongo-storage ---
[INFO] Compiling 20 source files to <https://builds.apache.org/job/drill-scm/ws/contrib/storage-mongo/target/classes>
[INFO] 
[INFO] --- maven-resources-plugin:2.6:testResources (default-testResources) @ drill-mongo-storage
---
[INFO] Using 'UTF-8' encoding to copy filtered resources.
[INFO] Copying 4 resources
[INFO] Copying 3 resources
[INFO] 
[INFO] --- maven-compiler-plugin:3.2:testCompile (default-testCompile) @ drill-mongo-storage
---
[INFO] Compiling 8 source files to <https://builds.apache.org/job/drill-scm/ws/contrib/storage-mongo/target/test-classes>
[INFO] 
[INFO] --- maven-surefire-plugin:2.17:test (default-test) @ drill-mongo-storage ---
[INFO] Tests are skipped.
[INFO] 
[INFO] --- maven-jar-plugin:2.4:jar (default-jar) @ drill-mongo-storage ---
[INFO] Building jar: <https://builds.apache.org/job/drill-scm/ws/contrib/storage-mongo/target/drill-mongo-storage-1.12.0-SNAPSHOT.jar>
[INFO] 
[INFO] --- maven-site-plugin:3.3:attach-descriptor (attach-descriptor) @ drill-mongo-storage
---
[INFO] 
[INFO] --- maven-jar-plugin:2.4:test-jar (default) @ drill-mongo-storage ---
[INFO] Building jar: <https://builds.apache.org/job/drill-scm/ws/contrib/storage-mongo/target/drill-mongo-storage-1.12.0-SNAPSHOT-tests.jar>
[INFO] 
[INFO] --- maven-checkstyle-plugin:2.12.1:check (checkstyle-validation) @ drill-mongo-storage
---
[INFO] Starting audit...
Audit done.

[INFO] 
[INFO] --- maven-enforcer-plugin:1.3.1:enforce (avoid_bad_dependencies) @ drill-mongo-storage
---
[INFO] 
[INFO] --- maven-install-plugin:2.5.1:install (default-install) @ drill-mongo-storage ---
[INFO] Installing <https://builds.apache.org/job/drill-scm/ws/contrib/storage-mongo/target/drill-mongo-storage-1.12.0-SNAPSHOT.jar>
to /home/jenkins/.m2/repository/org/apache/drill/contrib/drill-mongo-storage/1.12.0-SNAPSHOT/drill-mongo-storage-1.12.0-SNAPSHOT.jar
[INFO] Installing <https://builds.apache.org/job/drill-scm/ws/contrib/storage-mongo/pom.xml>
to /home/jenkins/.m2/repository/org/apache/drill/contrib/drill-mongo-storage/1.12.0-SNAPSHOT/drill-mongo-storage-1.12.0-SNAPSHOT.pom
[INFO] Installing <https://builds.apache.org/job/drill-scm/ws/contrib/storage-mongo/target/drill-mongo-storage-1.12.0-SNAPSHOT-tests.jar>
to /home/jenkins/.m2/repository/org/apache/drill/contrib/drill-mongo-storage/1.12.0-SNAPSHOT/drill-mongo-storage-1.12.0-SNAPSHOT-tests.jar
[INFO]                                                                         
[INFO] ------------------------------------------------------------------------
[INFO] Building contrib/hbase-storage-plugin 1.12.0-SNAPSHOT
[INFO] ------------------------------------------------------------------------
[INFO] 
[INFO] --- maven-clean-plugin:2.5:clean (default-clean) @ drill-storage-hbase ---
[INFO] Deleting <https://builds.apache.org/job/drill-scm/ws/contrib/storage-hbase/target>
[INFO] 
[INFO] --- apache-rat-plugin:0.12:check (rat-checks) @ drill-storage-hbase ---
[INFO] Enabled default license matchers.
[INFO] Will parse SCM ignores for exclusions...
[INFO] Finished adding exclusions from SCM ignore files.
[INFO] 61 implicit excludes (use -debug for more details).
[INFO] Exclude: **/*.log
[INFO] Exclude: **/*.css
[INFO] Exclude: **/*.js
[INFO] Exclude: **/*.md
[INFO] Exclude: **/*.eps
[INFO] Exclude: **/*.json
[INFO] Exclude: **/*.seq
[INFO] Exclude: **/*.parquet
[INFO] Exclude: **/*.sql
[INFO] Exclude: **/git.properties
[INFO] Exclude: **/*.csv
[INFO] Exclude: **/*.csvh
[INFO] Exclude: **/*.csvh-test
[INFO] Exclude: **/*.tsv
[INFO] Exclude: **/*.txt
[INFO] Exclude: **/*.ssv
[INFO] Exclude: **/drill-*.conf
[INFO] Exclude: **/.buildpath
[INFO] Exclude: **/*.proto
[INFO] Exclude: **/*.fmpp
[INFO] Exclude: **/target/**
[INFO] Exclude: **/*.iml
[INFO] Exclude: **/.idea/**
[INFO] Exclude: **/*.tdd
[INFO] Exclude: **/*.project
[INFO] Exclude: **/TAGS
[INFO] Exclude: **/*.checkstyle
[INFO] Exclude: **/.classpath
[INFO] Exclude: **/.settings/**
[INFO] Exclude: .*/**
[INFO] Exclude: **/*.patch
[INFO] Exclude: **/*.pb.cc
[INFO] Exclude: **/*.pb.h
[INFO] Exclude: **/*.linux
[INFO] Exclude: **/client/build/**
[INFO] Exclude: **/cmake_install.cmake
[INFO] Exclude: **/*.tbl
[INFO] Exclude: **/*.httpd
[INFO] Exclude: **/*.autotools
[INFO] Exclude: **/*.cproject
[INFO] Exclude: **/*.drill
[INFO] Exclude: dependency-reduced-pom.xml
[INFO] 49 resources included (use -debug for more details)
[INFO] Rat check: Summary over all files. Unapproved: 0, unknown: 0, generated: 0, approved:
49 licenses.
[INFO] 
[INFO] --- git-commit-id-plugin:2.1.9:revision (for-jars) @ drill-storage-hbase ---
[INFO] 
[INFO] --- maven-resources-plugin:2.6:copy-resources (copy-java-sources) @ drill-storage-hbase
---
[INFO] Using 'UTF-8' encoding to copy filtered resources.
[INFO] Copying 12 resources
[INFO] Copying 14 resources
[INFO] skip non existing resourceDirectory <https://builds.apache.org/job/drill-scm/ws/contrib/storage-hbase/target/generated-sources>
[INFO] 
[INFO] --- maven-remote-resources-plugin:1.5:process (default) @ drill-storage-hbase ---
[INFO] 
[INFO] --- maven-resources-plugin:2.6:resources (default-resources) @ drill-storage-hbase
---
[INFO] Using 'UTF-8' encoding to copy filtered resources.
[INFO] Copying 2 resources
[INFO] Copying 3 resources
[INFO] 
[INFO] --- maven-compiler-plugin:3.2:compile (default-compile) @ drill-storage-hbase ---
[INFO] Compiling 33 source files to <https://builds.apache.org/job/drill-scm/ws/contrib/storage-hbase/target/classes>
[INFO] -------------------------------------------------------------
[ERROR] COMPILATION ERROR : 
[INFO] -------------------------------------------------------------
[ERROR] <https://builds.apache.org/job/drill-scm/ws/contrib/storage-hbase/src/main/java/org/apache/drill/exec/store/hbase/HBaseGroupScan.java>:[147,11]
error: cannot find symbol
[INFO] 1 error
[INFO] -------------------------------------------------------------
[INFO] ------------------------------------------------------------------------
[INFO] Reactor Summary:
[INFO] 
[INFO] Apache Drill Root POM .............................. SUCCESS [ 23.756 s]
[INFO] tools/Parent Pom ................................... SUCCESS [  1.528 s]
[INFO] tools/freemarker codegen tooling ................... SUCCESS [ 11.852 s]
[INFO] Drill Protocol ..................................... SUCCESS [ 22.082 s]
[INFO] Common (Logical Plan, Base expressions) ............ SUCCESS [ 10.620 s]
[INFO] Logical Plan, Base expressions ..................... SUCCESS [ 14.823 s]
[INFO] exec/Parent Pom .................................... SUCCESS [  2.343 s]
[INFO] exec/memory/Parent Pom ............................. SUCCESS [  1.306 s]
[INFO] exec/memory/base ................................... SUCCESS [  6.757 s]
[INFO] exec/rpc ........................................... SUCCESS [  6.469 s]
[INFO] exec/Vectors ....................................... SUCCESS [17:26 min]
[INFO] contrib/Parent Pom ................................. SUCCESS [  2.236 s]
[INFO] contrib/data/Parent Pom ............................ SUCCESS [  1.561 s]
[INFO] contrib/data/tpch-sample-data ...................... SUCCESS [  5.712 s]
[INFO] exec/Java Execution Engine ......................... SUCCESS [02:27 min]
[INFO] exec/JDBC Driver using dependencies ................ SUCCESS [ 26.481 s]
[INFO] JDBC JAR with all dependencies ..................... SUCCESS [01:49 min]
[INFO] contrib/kudu-storage-plugin ........................ SUCCESS [ 36.350 s]
[INFO] contrib/mongo-storage-plugin ....................... SUCCESS [ 13.948 s]
[INFO] contrib/hbase-storage-plugin ....................... FAILURE [ 35.997 s]
[INFO] contrib/jdbc-storage-plugin ........................ SKIPPED
[INFO] contrib/hive-storage-plugin/Parent Pom ............. SKIPPED
[INFO] contrib/hive-storage-plugin/hive-exec-shaded ....... SKIPPED
[INFO] contrib/hive-storage-plugin/core ................... SKIPPED
[INFO] contrib/drill-gis-plugin ........................... SKIPPED
[INFO] Packaging and Distribution Assembly ................ SKIPPED
[INFO] contrib/mapr-format-plugin ......................... SKIPPED
[INFO] contrib/sqlline .................................... SKIPPED
[INFO] ------------------------------------------------------------------------
[INFO] BUILD FAILURE
[INFO] ------------------------------------------------------------------------
[INFO] Total time: 25:28 min
[INFO] Finished at: 2017-10-11T21:55:49+00:00
[INFO] Final Memory: 155M/1021M
[INFO] ------------------------------------------------------------------------
[ERROR] Failed to execute goal org.apache.maven.plugins:maven-compiler-plugin:3.2:compile
(default-compile) on project drill-storage-hbase: Compilation failure
[ERROR] <https://builds.apache.org/job/drill-scm/ws/contrib/storage-hbase/src/main/java/org/apache/drill/exec/store/hbase/HBaseGroupScan.java>:[147,11]
error: cannot find symbol
[ERROR] -> [Help 1]
[ERROR] 
[ERROR] To see the full stack trace of the errors, re-run Maven with the -e switch.
[ERROR] Re-run Maven using the -X switch to enable full debug logging.
[ERROR] 
[ERROR] For more information about the errors and possible solutions, please read the following
articles:
[ERROR] [Help 1] http://cwiki.apache.org/confluence/display/MAVEN/MojoFailureException
[ERROR] 
[ERROR] After correcting the problems, you can resume the build with the command
[ERROR]   mvn <goals> -rf :drill-storage-hbase
Build step 'Invoke top-level Maven targets' marked build as failure
Archiving artifacts

Mime
View raw message