drill-dev mailing list archives

Site index · List index
Message view « Date » · « Thread »
Top « Date » · « Thread »
From Timothy Farkas <tfar...@mapr.com>
Subject Failing Tests In Master
Date Thu, 17 Aug 2017 22:55:32 GMT
These tests are consistently failing for me with the latest master. Does anyone else see this
issue?


Failed tests:

  TestMetadataProvider.tables:153 expected:<OK> but was:<FAILED>

  TestMetadataProvider.tablesWithTableNameFilter:212 expected:<OK> but was:<FAILED>

  TestMetadataProvider.tablesWithSystemTableFilter:187 expected:<OK> but was:<FAILED>

  TestMetadataProvider.tablesWithTableFilter:176 expected:<OK> but was:<FAILED>


Tests in error:

  TestCustomUserAuthenticator.positiveUserAuth » UserRemote SYSTEM ERROR: URISyn...

  TestCustomUserAuthenticator.positiveUserAuthAfterNegativeUserAuth » UserRemote

  TestInfoSchema.selectFromAllTables » UserRemote SYSTEM ERROR: URISyntaxExcepti...

  TestViewSupport.infoSchemaWithView:350->BaseTestQuery.testRunAndReturn:344 » Rpc

  TestInfoSchemaFilterPushDown.testFilterPushdown_NonEqual » UserRemote SYSTEM E...

  TestParquetScan.testSuccessFile:58->BaseTestQuery.testRunAndReturn:344 » Rpc o...

Thanks,
Tim


Mime
  • Unnamed multipart/alternative (inline, None, 0 bytes)
View raw message