drill-dev mailing list archives

Site index · List index
Message view « Date » · « Thread »
Top « Date » · « Thread »
From Apache Jenkins Server <jenk...@builds.apache.org>
Subject Build failed in Jenkins: drill-scm #647
Date Thu, 28 Jan 2016 15:16:44 GMT
See <https://builds.apache.org/job/drill-scm/647/>

------------------------------------------
[...truncated 43905 lines...]
Downloading: http://scala-tools.org/repo-releases/org/apache/maven/plugin-tools/maven-plugin-tools/3.3/maven-plugin-tools-3.3.pom
         
Downloading: http://repo.maven.apache.org/maven2/org/apache/maven/plugin-tools/maven-plugin-tools/3.3/maven-plugin-tools-3.3.pom
4/13 KB   
8/13 KB   
12/13 KB   
13/13 KB   
           
Downloaded: http://repo.maven.apache.org/maven2/org/apache/maven/plugin-tools/maven-plugin-tools/3.3/maven-plugin-tools-3.3.pom
(13 KB at 650.1 KB/sec)
Downloading: http://onejar-maven-plugin.googlecode.com/svn/mavenrepo/org/apache/maven/surefire/surefire-api/2.18.1/surefire-api-2.18.1.pom
           
Downloading: http://scala-tools.org/repo-releases/org/apache/maven/surefire/surefire-api/2.18.1/surefire-api-2.18.1.pom
           
Downloading: http://repo.maven.apache.org/maven2/org/apache/maven/surefire/surefire-api/2.18.1/surefire-api-2.18.1.pom
3/3 KB     
         
Downloaded: http://repo.maven.apache.org/maven2/org/apache/maven/surefire/surefire-api/2.18.1/surefire-api-2.18.1.pom
(3 KB at 111.5 KB/sec)
Downloading: http://onejar-maven-plugin.googlecode.com/svn/mavenrepo/org/apache/maven/surefire/surefire-booter/2.18.1/surefire-booter-2.18.1.pom
         
Downloading: http://scala-tools.org/repo-releases/org/apache/maven/surefire/surefire-booter/2.18.1/surefire-booter-2.18.1.pom
         
Downloading: http://repo.maven.apache.org/maven2/org/apache/maven/surefire/surefire-booter/2.18.1/surefire-booter-2.18.1.pom
3/3 KB   
         
Downloaded: http://repo.maven.apache.org/maven2/org/apache/maven/surefire/surefire-booter/2.18.1/surefire-booter-2.18.1.pom
(3 KB at 142.3 KB/sec)
Downloading: http://onejar-maven-plugin.googlecode.com/svn/mavenrepo/org/apache/maven/maven-toolchain/2.2.1/maven-toolchain-2.2.1.pom
         
Downloading: http://scala-tools.org/repo-releases/org/apache/maven/maven-toolchain/2.2.1/maven-toolchain-2.2.1.pom
         
Downloading: http://repo.maven.apache.org/maven2/org/apache/maven/maven-toolchain/2.2.1/maven-toolchain-2.2.1.pom
4/4 KB   
         
Downloaded: http://repo.maven.apache.org/maven2/org/apache/maven/maven-toolchain/2.2.1/maven-toolchain-2.2.1.pom
(4 KB at 155.5 KB/sec)
Downloading: http://onejar-maven-plugin.googlecode.com/svn/mavenrepo/org/apache/maven/surefire/maven-surefire-common/2.18.1/maven-surefire-common-2.18.1.jar
Downloading: http://onejar-maven-plugin.googlecode.com/svn/mavenrepo/org/apache/maven/surefire/surefire-booter/2.18.1/surefire-booter-2.18.1.jar
Downloading: http://onejar-maven-plugin.googlecode.com/svn/mavenrepo/org/apache/maven/surefire/surefire-api/2.18.1/surefire-api-2.18.1.jar
Downloading: http://onejar-maven-plugin.googlecode.com/svn/mavenrepo/org/apache/maven/plugin-tools/maven-plugin-annotations/3.3/maven-plugin-annotations-3.3.jar
         
         
         
         
Downloading: http://scala-tools.org/repo-releases/org/apache/maven/surefire/maven-surefire-common/2.18.1/maven-surefire-common-2.18.1.jar
Downloading: http://scala-tools.org/repo-releases/org/apache/maven/surefire/surefire-booter/2.18.1/surefire-booter-2.18.1.jar
Downloading: http://scala-tools.org/repo-releases/org/apache/maven/plugin-tools/maven-plugin-annotations/3.3/maven-plugin-annotations-3.3.jar
Downloading: http://scala-tools.org/repo-releases/org/apache/maven/surefire/surefire-api/2.18.1/surefire-api-2.18.1.jar
         
         
         
         
Downloading: http://repo.maven.apache.org/maven2/org/apache/maven/surefire/maven-surefire-common/2.18.1/maven-surefire-common-2.18.1.jar
Downloading: http://repo.maven.apache.org/maven2/org/apache/maven/surefire/surefire-booter/2.18.1/surefire-booter-2.18.1.jar
Downloading: http://repo.maven.apache.org/maven2/org/apache/maven/surefire/surefire-api/2.18.1/surefire-api-2.18.1.jar
Downloading: http://repo.maven.apache.org/maven2/org/apache/maven/plugin-tools/maven-plugin-annotations/3.3/maven-plugin-annotations-3.3.jar
4/39 KB   
8/39 KB   
12/39 KB   
16/39 KB   
20/39 KB   
24/39 KB   
28/39 KB   
32/39 KB   
36/39 KB   
39/39 KB   
4/145 KB   39/39 KB   
8/145 KB   39/39 KB   
12/145 KB   39/39 KB   
16/145 KB   39/39 KB   
20/145 KB   39/39 KB   
24/145 KB   39/39 KB   
28/145 KB   39/39 KB   
32/145 KB   39/39 KB   
36/145 KB   39/39 KB   
40/145 KB   39/39 KB   
44/145 KB   39/39 KB   
48/145 KB   39/39 KB   
52/145 KB   39/39 KB   
56/145 KB   39/39 KB   
60/145 KB   39/39 KB   
64/145 KB   39/39 KB   
68/145 KB   39/39 KB   
72/145 KB   39/39 KB   
76/145 KB   39/39 KB   
80/145 KB   39/39 KB   
84/145 KB   39/39 KB   
88/145 KB   39/39 KB   
92/145 KB   39/39 KB   
96/145 KB   39/39 KB   
100/145 KB   39/39 KB   
104/145 KB   39/39 KB   
108/145 KB   39/39 KB   
112/145 KB   39/39 KB   
116/145 KB   39/39 KB   
120/145 KB   39/39 KB   
124/145 KB   39/39 KB   
128/145 KB   39/39 KB   
132/145 KB   39/39 KB   
136/145 KB   39/39 KB   
140/145 KB   39/39 KB   
144/145 KB   39/39 KB   
145/145 KB   39/39 KB   
145/145 KB   39/39 KB   4/269 KB   
145/145 KB   39/39 KB   8/269 KB   
145/145 KB   39/39 KB   12/269 KB   
                                    
145/145 KB   16/269 KB              
Downloaded: http://repo.maven.apache.org/maven2/org/apache/maven/surefire/surefire-booter/2.18.1/surefire-booter-2.18.1.jar
(39 KB at 3540.2 KB/sec)
145/145 KB   20/269 KB   
145/145 KB   24/269 KB   
145/145 KB   28/269 KB   
145/145 KB   32/269 KB   
145/145 KB   32/269 KB   
145/145 KB   32/269 KB   4/14 KB   
145/145 KB   32/269 KB   8/14 KB   
145/145 KB   32/269 KB   12/14 KB   
145/145 KB   32/269 KB   14/14 KB   
                                    
Downloaded: http://repo.maven.apache.org/maven2/org/apache/maven/surefire/surefire-api/2.18.1/surefire-api-2.18.1.jar
(145 KB at 10321.4 KB/sec)
36/269 KB   14/14 KB                
40/269 KB   14/14 KB   
44/269 KB   14/14 KB   
48/269 KB   14/14 KB   
52/269 KB   14/14 KB   
56/269 KB   14/14 KB   
60/269 KB   14/14 KB   
64/269 KB   14/14 KB   
68/269 KB   14/14 KB   
72/269 KB   14/14 KB   
76/269 KB   14/14 KB   
80/269 KB   14/14 KB   
84/269 KB   14/14 KB   
88/269 KB   14/14 KB   
92/269 KB   14/14 KB   
95/269 KB   14/14 KB   
                       
Downloaded: http://repo.maven.apache.org/maven2/org/apache/maven/plugin-tools/maven-plugin-annotations/3.3/maven-plugin-annotations-3.3.jar
(14 KB at 685.5 KB/sec)
99/269 KB              
103/269 KB   
107/269 KB   
111/269 KB   
115/269 KB   
119/269 KB   
123/269 KB   
127/269 KB   
131/269 KB   
135/269 KB   
139/269 KB   
143/269 KB   
147/269 KB   
151/269 KB   
155/269 KB   
159/269 KB   
163/269 KB   
167/269 KB   
171/269 KB   
175/269 KB   
179/269 KB   
183/269 KB   
185/269 KB   
189/269 KB   
193/269 KB   
197/269 KB   
201/269 KB   
205/269 KB   
209/269 KB   
213/269 KB   
217/269 KB   
221/269 KB   
225/269 KB   
229/269 KB   
233/269 KB   
237/269 KB   
241/269 KB   
245/269 KB   
249/269 KB   
253/269 KB   
257/269 KB   
261/269 KB   
265/269 KB   
269/269 KB   
             
Downloaded: http://repo.maven.apache.org/maven2/org/apache/maven/surefire/maven-surefire-common/2.18.1/maven-surefire-common-2.18.1.jar
(269 KB at 6381.0 KB/sec)
[INFO] Tests are skipped.
[INFO] 
[INFO] --- maven-checkstyle-plugin:2.12.1:check (checkstyle-validation) @ drill-jdbc-all ---
[INFO] Starting audit...
Audit done.

[INFO] 
[INFO] --- maven-failsafe-plugin:2.18.1:verify (default) @ drill-jdbc-all ---
[INFO] Tests are skipped.
[INFO] 
[INFO] --- maven-enforcer-plugin:1.3.1:enforce (avoid_bad_dependencies) @ drill-jdbc-all ---
[INFO] 
[INFO] --- maven-enforcer-plugin:1.3.1:enforce (enforce-jdbc-jar-compactness) @ drill-jdbc-all
---
[WARNING] Rule 0: org.apache.maven.plugins.enforcer.RequireFilesSize failed with message:
The file drill-jdbc-all-1.5.0-SNAPSHOT.jar is outside the expected size range. 
                  
                  This is likely due to you adding new dependencies to a java-exec and not
updating the excludes in this module. This is important as it minimizes the size of the dependency
of Drill application users.
<https://builds.apache.org/job/drill-scm/ws/exec/jdbc-all/target/drill-jdbc-all-1.5.0-SNAPSHOT.jar>
size (44664206) too large. Max. is 20000000<https://builds.apache.org/job/drill-scm/ws/exec/jdbc-all/target/drill-jdbc-all-1.5.0-SNAPSHOT.jar>

[INFO] ------------------------------------------------------------------------
[INFO] Reactor Summary:
[INFO] 
[INFO] Apache Drill Root POM ............................. SUCCESS [27.278s]
[INFO] tools/Parent Pom .................................. SUCCESS [1.241s]
[INFO] tools/freemarker codegen tooling .................. SUCCESS [21.502s]
[INFO] Drill Protocol .................................... SUCCESS [15.266s]
[INFO] Common (Logical Plan, Base expressions) ........... SUCCESS [20.133s]
[INFO] Logical Plan, Base expressions .................... SUCCESS [14.523s]
[INFO] exec/Parent Pom ................................... SUCCESS [0.904s]
[INFO] exec/memory/Parent Pom ............................ SUCCESS [0.808s]
[INFO] exec/memory/base .................................. SUCCESS [6.773s]
[INFO] exec/rpc .......................................... SUCCESS [5.590s]
[INFO] exec/Vectors ...................................... SUCCESS [1:28.703s]
[INFO] contrib/Parent Pom ................................ SUCCESS [0.810s]
[INFO] contrib/data/Parent Pom ........................... SUCCESS [0.749s]
[INFO] contrib/data/tpch-sample-data ..................... SUCCESS [9.078s]
[INFO] exec/Java Execution Engine ........................ SUCCESS [1:54.406s]
[INFO] exec/JDBC Driver using dependencies ............... SUCCESS [33.256s]
[INFO] JDBC JAR with all dependencies .................... FAILURE [53.218s]
[INFO] contrib/kudu-storage-plugin ....................... SKIPPED
[INFO] contrib/mongo-storage-plugin ...................... SKIPPED
[INFO] contrib/hbase-storage-plugin ...................... SKIPPED
[INFO] contrib/jdbc-storage-plugin ....................... SKIPPED
[INFO] contrib/hive-storage-plugin/Parent Pom ............ SKIPPED
[INFO] contrib/hive-storage-plugin/hive-exec-shaded ...... SKIPPED
[INFO] contrib/hive-storage-plugin/core .................. SKIPPED
[INFO] contrib/drill-gis-plugin .......................... SKIPPED
[INFO] Packaging and Distribution Assembly ............... SKIPPED
[INFO] contrib/sqlline ................................... SKIPPED
[INFO] ------------------------------------------------------------------------
[INFO] BUILD FAILURE
[INFO] ------------------------------------------------------------------------
[INFO] Total time: 6:56.198s
[INFO] Finished at: Thu Jan 28 15:16:49 UTC 2016
[INFO] Final Memory: 122M/1010M
[INFO] ------------------------------------------------------------------------
[ERROR] Failed to execute goal org.apache.maven.plugins:maven-enforcer-plugin:1.3.1:enforce
(enforce-jdbc-jar-compactness) on project drill-jdbc-all: Some Enforcer rules have failed.
Look above for specific messages explaining why the rule failed. -> [Help 1]
[ERROR] 
[ERROR] To see the full stack trace of the errors, re-run Maven with the -e switch.
[ERROR] Re-run Maven using the -X switch to enable full debug logging.
[ERROR] 
[ERROR] For more information about the errors and possible solutions, please read the following
articles:
[ERROR] [Help 1] http://cwiki.apache.org/confluence/display/MAVEN/MojoExecutionException
[ERROR] 
[ERROR] After correcting the problems, you can resume the build with the command
[ERROR]   mvn <goals> -rf :drill-jdbc-all
Build step 'Invoke top-level Maven targets' marked build as failure
Archiving artifacts

Mime
View raw message