drill-dev mailing list archives

Site index · List index
Message view « Date » · « Thread »
Top « Date » · « Thread »
From Abdel Hakim Deneche <adene...@maprtech.com>
Subject maven error when running unit tests on master
Date Fri, 13 Nov 2015 21:13:18 GMT
If I run

mvn clean install -DskipTests
> mvn test


I get the following error when I run the tests:

[INFO]
> ------------------------------------------------------------------------
> [INFO] Reactor Summary:
> [INFO]
> [INFO] Apache Drill Root POM .............................. SUCCESS [
> 4.593 s]
> [INFO] ...
> [INFO] exec/Java Execution Engine ......................... FAILURE [
> 2.531 s]
> [INFO] exec/JDBC Driver using dependencies ................ SKIPPED
> [INFO] ...
> [INFO] contrib/sqlline .................................... SKIPPED
> [INFO]
> ------------------------------------------------------------------------
> [INFO] BUILD FAILURE
> [INFO]
> ------------------------------------------------------------------------
> [INFO] Total time: 36.305 s
> [INFO] Finished at: 2015-11-13T21:05:08+00:00
> [INFO] Final Memory: 118M/1445M
> [INFO]
> ------------------------------------------------------------------------
> [ERROR] Failed to execute goal
> org.apache.maven.plugins:maven-dependency-plugin:2.8:unpack
> (unpack-vector-types) on project drill-java-exec: Artifact has not been
> packaged yet. When used on reactor artifact, unpack should be executed
> after packaging: see MDEP-98. -> [Help 1]


I've seen this on both Mac with maven 3.3.3 and CentOS with maven 3.3.1

-- 

Abdelhakim Deneche

Software Engineer

  <http://www.mapr.com/>


Now Available - Free Hadoop On-Demand Training
<http://www.mapr.com/training?utm_source=Email&utm_medium=Signature&utm_campaign=Free%20available>

Mime
  • Unnamed multipart/alternative (inline, None, 0 bytes)
View raw message