drill-dev mailing list archives

Site index · List index
Message view « Date » · « Thread »
Top « Date » · « Thread »
From Apache Jenkins Server <jenk...@builds.apache.org>
Subject Build failed in Jenkins: drill-scm #596
Date Fri, 20 Nov 2015 02:28:31 GMT
See <https://builds.apache.org/job/drill-scm/596/changes>

Changes:

[hanifigunes] DRILL-3171: handle concurrent Zookeeper node creation gracefully

------------------------------------------
[...truncated 89301 lines...]
4/4 KB   1496/1906 KB   282/548 KB   
4/4 KB   1500/1906 KB   282/548 KB   
4/4 KB   1504/1906 KB   282/548 KB   
4/4 KB   1508/1906 KB   282/548 KB   
4/4 KB   1512/1906 KB   282/548 KB   
4/4 KB   1516/1906 KB   282/548 KB   
4/4 KB   1520/1906 KB   282/548 KB   
4/4 KB   1524/1906 KB   282/548 KB   
4/4 KB   1528/1906 KB   282/548 KB   
4/4 KB   1532/1906 KB   282/548 KB   
4/4 KB   1532/1906 KB   285/548 KB   
4/4 KB   1536/1906 KB   285/548 KB   
4/4 KB   1540/1906 KB   285/548 KB   
4/4 KB   1544/1906 KB   285/548 KB   
4/4 KB   1548/1906 KB   285/548 KB   
4/4 KB   1552/1906 KB   285/548 KB   
4/4 KB   1556/1906 KB   285/548 KB   
4/4 KB   1560/1906 KB   285/548 KB   
4/4 KB   1564/1906 KB   285/548 KB   
4/4 KB   1568/1906 KB   285/548 KB   
4/4 KB   1572/1906 KB   285/548 KB   
4/4 KB   1576/1906 KB   285/548 KB   
4/4 KB   1580/1906 KB   285/548 KB   
4/4 KB   1584/1906 KB   285/548 KB   
4/4 KB   1588/1906 KB   285/548 KB   
4/4 KB   1592/1906 KB   285/548 KB   
4/4 KB   1596/1906 KB   285/548 KB   
4/4 KB   1600/1906 KB   285/548 KB   
4/4 KB   1604/1906 KB   285/548 KB   
4/4 KB   1608/1906 KB   285/548 KB   
4/4 KB   1612/1906 KB   285/548 KB   
4/4 KB   1616/1906 KB   285/548 KB   
4/4 KB   1620/1906 KB   285/548 KB   
4/4 KB   1620/1906 KB   289/548 KB   
4/4 KB   1624/1906 KB   289/548 KB   
4/4 KB   1628/1906 KB   289/548 KB   
4/4 KB   1628/1906 KB   293/548 KB   
4/4 KB   1632/1906 KB   293/548 KB   
4/4 KB   1632/1906 KB   295/548 KB   
4/4 KB   1636/1906 KB   295/548 KB   
4/4 KB   1640/1906 KB   295/548 KB   
4/4 KB   1640/1906 KB   299/548 KB   
4/4 KB   1644/1906 KB   299/548 KB   
4/4 KB   1648/1906 KB   299/548 KB   
4/4 KB   1648/1906 KB   302/548 KB   
4/4 KB   1652/1906 KB   302/548 KB   
4/4 KB   1656/1906 KB   302/548 KB   
4/4 KB   1656/1906 KB   306/548 KB   
4/4 KB   1660/1906 KB   306/548 KB   
4/4 KB   1664/1906 KB   306/548 KB   
4/4 KB   1664/1906 KB   310/548 KB   
4/4 KB   1668/1906 KB   310/548 KB   
4/4 KB   1668/1906 KB   314/548 KB   
4/4 KB   1672/1906 KB   314/548 KB   
4/4 KB   1676/1906 KB   314/548 KB   
4/4 KB   1676/1906 KB   318/548 KB   
4/4 KB   1680/1906 KB   318/548 KB   
4/4 KB   1684/1906 KB   318/548 KB   
4/4 KB   1684/1906 KB   322/548 KB   
4/4 KB   1688/1906 KB   322/548 KB   
4/4 KB   1692/1906 KB   322/548 KB   
4/4 KB   1696/1906 KB   322/548 KB   
4/4 KB   1696/1906 KB   326/548 KB   
4/4 KB   1700/1906 KB   326/548 KB   
4/4 KB   1704/1906 KB   330/548 KB   
4/4 KB   1704/1906 KB   330/548 KB   
4/4 KB   1708/1906 KB   330/548 KB   
4/4 KB   1708/1906 KB   334/548 KB   
4/4 KB   1712/1906 KB   334/548 KB   
4/4 KB   1716/1906 KB   334/548 KB   
4/4 KB   1716/1906 KB   338/548 KB   
4/4 KB   1720/1906 KB   338/548 KB   
4/4 KB   1724/1906 KB   338/548 KB   
4/4 KB   1724/1906 KB   342/548 KB   
4/4 KB   1728/1906 KB   342/548 KB   
4/4 KB   1732/1906 KB   342/548 KB   
4/4 KB   1732/1906 KB   346/548 KB   
4/4 KB   1736/1906 KB   346/548 KB   
4/4 KB   1740/1906 KB   346/548 KB   
4/4 KB   1740/1906 KB   350/548 KB   
4/4 KB   1744/1906 KB   350/548 KB   
4/4 KB   1748/1906 KB   350/548 KB   
4/4 KB   1748/1906 KB   354/548 KB   
4/4 KB   1752/1906 KB   354/548 KB   
4/4 KB   1756/1906 KB   354/548 KB   
4/4 KB   1756/1906 KB   358/548 KB   
4/4 KB   1760/1906 KB   358/548 KB   
4/4 KB   1764/1906 KB   358/548 KB   
4/4 KB   1764/1906 KB   362/548 KB   
4/4 KB   1768/1906 KB   362/548 KB   
4/4 KB   1768/1906 KB   366/548 KB   
4/4 KB   1772/1906 KB   366/548 KB   
4/4 KB   1776/1906 KB   366/548 KB   
4/4 KB   1776/1906 KB   370/548 KB   
4/4 KB   1780/1906 KB   370/548 KB   
4/4 KB   1784/1906 KB   370/548 KB   
4/4 KB   1784/1906 KB   374/548 KB   
4/4 KB   1788/1906 KB   374/548 KB   
4/4 KB   1792/1906 KB   374/548 KB   
4/4 KB   1792/1906 KB   378/548 KB   
4/4 KB   1796/1906 KB   378/548 KB   
4/4 KB   1800/1906 KB   378/548 KB   
4/4 KB   1800/1906 KB   382/548 KB   
4/4 KB   1804/1906 KB   382/548 KB   
4/4 KB   1808/1906 KB   382/548 KB   
4/4 KB   1808/1906 KB   386/548 KB   
4/4 KB   1812/1906 KB   386/548 KB   
4/4 KB   1816/1906 KB   386/548 KB   
4/4 KB   1816/1906 KB   390/548 KB   
4/4 KB   1820/1906 KB   390/548 KB   
4/4 KB   1824/1906 KB   390/548 KB   
4/4 KB   1824/1906 KB   394/548 KB   
4/4 KB   1828/1906 KB   394/548 KB   
4/4 KB   1832/1906 KB   394/548 KB   
4/4 KB   1832/1906 KB   398/548 KB   
4/4 KB   1836/1906 KB   398/548 KB   
4/4 KB   1840/1906 KB   398/548 KB   
4/4 KB   1840/1906 KB   402/548 KB   
4/4 KB   1844/1906 KB   402/548 KB   
4/4 KB   1848/1906 KB   402/548 KB   
4/4 KB   1848/1906 KB   406/548 KB   
4/4 KB   1852/1906 KB   406/548 KB   
4/4 KB   1856/1906 KB   406/548 KB   
4/4 KB   1856/1906 KB   410/548 KB   
4/4 KB   1860/1906 KB   410/548 KB   
4/4 KB   1864/1906 KB   410/548 KB   
4/4 KB   1864/1906 KB   414/548 KB   
4/4 KB   1868/1906 KB   414/548 KB   
4/4 KB   1872/1906 KB   414/548 KB   
4/4 KB   1872/1906 KB   418/548 KB   
4/4 KB   1876/1906 KB   418/548 KB   
4/4 KB   1880/1906 KB   418/548 KB   
4/4 KB   1880/1906 KB   422/548 KB   
4/4 KB   1884/1906 KB   422/548 KB   
4/4 KB   1888/1906 KB   422/548 KB   
4/4 KB   1888/1906 KB   426/548 KB   
4/4 KB   1892/1906 KB   426/548 KB   
4/4 KB   1892/1906 KB   430/548 KB   
4/4 KB   1896/1906 KB   430/548 KB   
4/4 KB   1896/1906 KB   434/548 KB   
4/4 KB   1900/1906 KB   434/548 KB   
4/4 KB   1904/1906 KB   434/548 KB   
4/4 KB   1904/1906 KB   438/548 KB   
4/4 KB   1906/1906 KB   438/548 KB   
4/4 KB   1906/1906 KB   442/548 KB   
4/4 KB   1906/1906 KB   446/548 KB   
4/4 KB   1906/1906 KB   450/548 KB   
4/4 KB   1906/1906 KB   454/548 KB   
4/4 KB   1906/1906 KB   458/548 KB   
4/4 KB   1906/1906 KB   462/548 KB   
4/4 KB   1906/1906 KB   466/548 KB   
4/4 KB   1906/1906 KB   470/548 KB   
4/4 KB   1906/1906 KB   474/548 KB   
4/4 KB   1906/1906 KB   478/548 KB   
4/4 KB   1906/1906 KB   482/548 KB   
4/4 KB   1906/1906 KB   486/548 KB   
4/4 KB   1906/1906 KB   490/548 KB   
4/4 KB   1906/1906 KB   494/548 KB   
4/4 KB   1906/1906 KB   498/548 KB   
4/4 KB   1906/1906 KB   502/548 KB   
4/4 KB   1906/1906 KB   506/548 KB   
4/4 KB   1906/1906 KB   510/548 KB   
4/4 KB   1906/1906 KB   514/548 KB   
4/4 KB   1906/1906 KB   518/548 KB   
4/4 KB   1906/1906 KB   522/548 KB   
4/4 KB   1906/1906 KB   526/548 KB   
4/4 KB   1906/1906 KB   530/548 KB   
4/4 KB   1906/1906 KB   534/548 KB   
4/4 KB   1906/1906 KB   538/548 KB   
4/4 KB   1906/1906 KB   542/548 KB   
4/4 KB   1906/1906 KB   546/548 KB   
4/4 KB   1906/1906 KB   548/548 KB   
4/4 KB   4/14 KB   1906/1906 KB   548/548 KB   
4/4 KB   8/14 KB   1906/1906 KB   548/548 KB   
4/4 KB   12/14 KB   1906/1906 KB   548/548 KB   
4/4 KB   14/14 KB   1906/1906 KB   548/548 KB   
                                                
Downloaded: http://repo.maven.apache.org/maven2/org/slf4j/slf4j-nop/1.7.7/slf4j-nop-1.7.7.jar
(4 KB at 79.9 KB/sec)
                                                
Downloaded: http://repo.maven.apache.org/maven2/org/apache/poi/poi/3.10-FINAL/poi-3.10-FINAL.jar
(1906 KB at 18319.0 KB/sec)
                                                
Downloaded: http://repo.maven.apache.org/maven2/org/dbunit/dbunit/2.5.0/dbunit-2.5.0.jar (548
KB at 3970.1 KB/sec)
                                                
Downloaded: http://repo.maven.apache.org/maven2/com/btmatthews/utils/monitor/2.1.3/monitor-2.1.3.jar
(14 KB at 202.4 KB/sec)
[INFO] Skipping inmemdb:run because inmemdb.skip=='true'
[INFO] 
[INFO] --- jcabi-mysql-maven-plugin:0.8.2:start (mysql-test) @ drill-jdbc-storage ---
[INFO] jcabi-aspects 0.20.1/f0aff93 started new daemon thread jcabi-cacheable for automated
cleaning of expired @Cacheable values
Nov 20, 2015 2:22:36 AM org.hibernate.validator.internal.util.Version <clinit>
INFO: HV000001: Hibernate Validator 5.2.0.Alpha1
[ERROR] JSR-303 validator failed to initialize: HV000183: Unable to load 'javax.el.ExpressionFactory'.
Check that you have the EL dependencies on the classpath, or use ParameterMessageInterpolator
instead (see http://aspects.jcabi.com/jsr-303.html)
[INFO] jcabi-aspects 0.20.1/f0aff93 started new daemon thread jcabi-loggable for watching
of @Loggable annotated methods
[INFO] reuse existing database false
[INFO] created <https://builds.apache.org/job/drill-scm/ws/contrib/storage-jdbc/target/mysql-data>
directory
[INFO] $ <https://builds.apache.org/job/drill-scm/ws/contrib/storage-jdbc/target/mysql-dist/scripts/mysql_install_db>
--defaults-file=<https://builds.apache.org/job/drill-scm/ws/contrib/storage-jdbc/target/mysql-data/my-default.cnf>
--force --innodb_use_native_aio=0 --datadir=<https://builds.apache.org/job/drill-scm/ws/contrib/storage-jdbc/target/mysql-data/data>
--basedir=<https://builds.apache.org/job/drill-scm/ws/contrib/storage-jdbc/target/mysql-dist>
[WARNING] >> <https://builds.apache.org/job/drill-scm/ws/contrib/storage-jdbc/target/mysql-dist/bin/mysqld>:
error while loading shared libraries: libaio.so.1: cannot open shared object file: No such
file or directory
[INFO] >> Installing MySQL system tables...
[INFO] $ <https://builds.apache.org/job/drill-scm/ws/contrib/storage-jdbc/target/mysql-dist/bin/mysqld>
--no-defaults --user=jenkins --general_log --console --innodb_buffer_pool_size=64M --innodb_log_file_size=64M
--log_warnings --innodb_use_native_aio=0 --binlog-ignore-db=drill_mysql_test --basedir=<https://builds.apache.org/job/drill-scm/ws/contrib/storage-jdbc/target/mysql-dist>
--lc-messages-dir=<https://builds.apache.org/job/drill-scm/ws/contrib/storage-jdbc/target/mysql-dist/share>
--datadir=<https://builds.apache.org/job/drill-scm/ws/contrib/storage-jdbc/target/mysql-data/data>
--tmpdir=<https://builds.apache.org/job/drill-scm/ws/contrib/storage-jdbc/target/mysql-data/temp>
--socket=<https://builds.apache.org/job/drill-scm/ws/contrib/storage-jdbc/target/mysql-data/mysql.sock>
--pid-file=<https://builds.apache.org/job/drill-scm/ws/contrib/storage-jdbc/target/mysql-data/mysql.pid>
--port=49602
[INFO] >> <https://builds.apache.org/job/drill-scm/ws/contrib/storage-jdbc/target/mysql-dist/bin/mysqld>:
error while loading shared libraries: libaio.so.1: cannot open shared object file: No such
file or directory
[ERROR] #start('Config(tcpport=49602, dbuser=root, dbpassword=root, name=drill_mysql_test,
dbopts=[])', <https://builds.apache.org/job/drill-scm/ws/contrib/storage-jdbc/target/mysql-dist,>
<https://builds.apache.org/job/drill-scm/ws/contrib/storage-jdbc/target/mysql-data,>
true, NULL): thrown java.io.IOException(socket <https://builds.apache.org/job/drill-scm/ws/contrib/storage-jdbc/target/mysql-data/mysql.sock>
is not available after 5min of waiting) out of com.jcabi.mysql.maven.plugin.Instances#waitFor[322]
in 5min
[INFO] ------------------------------------------------------------------------
[INFO] Reactor Summary:
[INFO] 
[INFO] Apache Drill Root POM ............................. SUCCESS [12.731s]
[INFO] tools/Parent Pom .................................. SUCCESS [0.988s]
[INFO] tools/freemarker codegen tooling .................. SUCCESS [10.254s]
[INFO] Drill Protocol .................................... SUCCESS [7.908s]
[INFO] Common (Logical Plan, Base expressions) ........... SUCCESS [6.475s]
[INFO] Logical Plan, Base expressions .................... SUCCESS [8.871s]
[INFO] exec/Parent Pom ................................... SUCCESS [0.975s]
[INFO] exec/memory/Parent Pom ............................ SUCCESS [0.517s]
[INFO] exec/memory/base .................................. SUCCESS [2.116s]
[INFO] exec/memory/impl .................................. SUCCESS [3.066s]
[INFO] exec/rpc .......................................... SUCCESS [3.098s]
[INFO] exec/Vectors ...................................... SUCCESS [1:13.110s]
[INFO] contrib/Parent Pom ................................ SUCCESS [0.932s]
[INFO] contrib/data/Parent Pom ........................... SUCCESS [0.535s]
[INFO] contrib/data/tpch-sample-data ..................... SUCCESS [3.594s]
[INFO] exec/Java Execution Engine ........................ SUCCESS [43.809s]
[INFO] exec/JDBC Driver using dependencies ............... SUCCESS [11.457s]
[INFO] JDBC JAR with all dependencies .................... SUCCESS [45.440s]
[INFO] contrib/mongo-storage-plugin ...................... SUCCESS [6.283s]
[INFO] contrib/hbase-storage-plugin ...................... SUCCESS [15.617s]
[INFO] contrib/jdbc-storage-plugin ....................... FAILURE [5:32.059s]
[INFO] contrib/hive-storage-plugin/Parent Pom ............ SKIPPED
[INFO] contrib/hive-storage-plugin/hive-exec-shaded ...... SKIPPED
[INFO] contrib/hive-storage-plugin/core .................. SKIPPED
[INFO] contrib/drill-gis-plugin .......................... SKIPPED
[INFO] Packaging and Distribution Assembly ............... SKIPPED
[INFO] contrib/sqlline ................................... SKIPPED
[INFO] ------------------------------------------------------------------------
[INFO] BUILD FAILURE
[INFO] ------------------------------------------------------------------------
[INFO] Total time: 9:51.060s
[INFO] Finished at: Fri Nov 20 02:27:36 UTC 2015
[INFO] Final Memory: 133M/1670M
[INFO] ------------------------------------------------------------------------
[ERROR] Failed to execute goal com.jcabi:jcabi-mysql-maven-plugin:0.8.2:start (mysql-test)
on project drill-jdbc-storage: failed to start MySQL server: socket <https://builds.apache.org/job/drill-scm/ws/contrib/storage-jdbc/target/mysql-data/mysql.sock>
is not available after 5min of waiting -> [Help 1]
[ERROR] 
[ERROR] To see the full stack trace of the errors, re-run Maven with the -e switch.
[ERROR] Re-run Maven using the -X switch to enable full debug logging.
[ERROR] 
[ERROR] For more information about the errors and possible solutions, please read the following
articles:
[ERROR] [Help 1] http://cwiki.apache.org/confluence/display/MAVEN/MojoFailureException
[ERROR] 
[ERROR] After correcting the problems, you can resume the build with the command
[ERROR]   mvn <goals> -rf :drill-jdbc-storage
Build step 'Invoke top-level Maven targets' marked build as failure
Archiving artifacts

Mime
View raw message