drill-dev mailing list archives

Site index · List index
Message view « Date » · « Thread »
Top « Date » · « Thread »
From Apache Jenkins Server <jenk...@builds.apache.org>
Subject Build failed in Jenkins: drill-scm #305
Date Fri, 10 Apr 2015 21:20:58 GMT
See <https://builds.apache.org/job/drill-scm/305/changes>

Changes:

[asinha] DRILL-2717: The upstream message returned by Union-All (when innerNext is called
on Union-All) is corrected

------------------------------------------
[...truncated 69148 lines...]
1161/1375 KB   
1163/1375 KB   
1164/1375 KB   
1165/1375 KB   
1167/1375 KB   
1168/1375 KB   
1169/1375 KB   
1171/1375 KB   
1172/1375 KB   
1173/1375 KB   
1175/1375 KB   
1176/1375 KB   
1177/1375 KB   
1179/1375 KB   
1180/1375 KB   
1181/1375 KB   
1183/1375 KB   
1184/1375 KB   
1185/1375 KB   
1187/1375 KB   
1188/1375 KB   
1189/1375 KB   
1191/1375 KB   
1192/1375 KB   
1193/1375 KB   
1195/1375 KB   
1196/1375 KB   
1197/1375 KB   
1199/1375 KB   
1200/1375 KB   
1201/1375 KB   
1203/1375 KB   
1204/1375 KB   
1205/1375 KB   
1208/1375 KB   
1209/1375 KB   
1211/1375 KB   
1212/1375 KB   
1213/1375 KB   
1215/1375 KB   
1216/1375 KB   
1217/1375 KB   
1219/1375 KB   
1220/1375 KB   
1221/1375 KB   
1223/1375 KB   
1224/1375 KB   
1225/1375 KB   
1227/1375 KB   
1228/1375 KB   
1229/1375 KB   
1231/1375 KB   
1232/1375 KB   
1233/1375 KB   
1235/1375 KB   
1236/1375 KB   
1237/1375 KB   
1239/1375 KB   
1240/1375 KB   
1241/1375 KB   
1243/1375 KB   
1244/1375 KB   
1245/1375 KB   
1247/1375 KB   
1248/1375 KB   
1249/1375 KB   
1251/1375 KB   
1254/1375 KB   
1255/1375 KB   
1256/1375 KB   
1258/1375 KB   
1259/1375 KB   
1260/1375 KB   
1262/1375 KB   
1263/1375 KB   
1264/1375 KB   
1266/1375 KB   
1267/1375 KB   
1268/1375 KB   
1270/1375 KB   
1271/1375 KB   
1272/1375 KB   
1274/1375 KB   
1275/1375 KB   
1276/1375 KB   
1278/1375 KB   
1279/1375 KB   
1280/1375 KB   
1282/1375 KB   
1283/1375 KB   
1284/1375 KB   
1286/1375 KB   
1287/1375 KB   
1288/1375 KB   
1290/1375 KB   
1291/1375 KB   
1292/1375 KB   
1294/1375 KB   
1295/1375 KB   
1296/1375 KB   
1298/1375 KB   
1299/1375 KB   
1300/1375 KB   
1302/1375 KB   
1303/1375 KB   
1304/1375 KB   
1306/1375 KB   
1307/1375 KB   
1308/1375 KB   
1310/1375 KB   
1311/1375 KB   
1312/1375 KB   
1314/1375 KB   
1315/1375 KB   
1316/1375 KB   
1318/1375 KB   
1319/1375 KB   
1320/1375 KB   
1322/1375 KB   
1323/1375 KB   
1324/1375 KB   
1326/1375 KB   
1327/1375 KB   
1328/1375 KB   
1332/1375 KB   
1332/1375 KB   
1335/1375 KB   
1336/1375 KB   
1338/1375 KB   
1339/1375 KB   
1340/1375 KB   
1342/1375 KB   
1343/1375 KB   
1344/1375 KB   
1346/1375 KB   
1347/1375 KB   
1348/1375 KB   
1350/1375 KB   
1351/1375 KB   
1352/1375 KB   
1354/1375 KB   
1355/1375 KB   
1356/1375 KB   
1358/1375 KB   
1359/1375 KB   
1360/1375 KB   
1362/1375 KB   
1363/1375 KB   
1364/1375 KB   
1366/1375 KB   
1367/1375 KB   
1368/1375 KB   
1370/1375 KB   
1371/1375 KB   
1372/1375 KB   
1374/1375 KB   
1375/1375 KB   
               
Downloaded: http://repo.pentaho.org/artifactory/repo/org/apache/hadoop/hadoop-yarn-common/2.4.1/hadoop-yarn-common-2.4.1.jar
(1375 KB at 714.4 KB/sec)
[INFO] 
[INFO] --- maven-clean-plugin:2.5:clean (default-clean) @ drill-java-exec ---
[INFO] 
[INFO] --- apache-rat-plugin:0.10:check (rat-checks) @ drill-java-exec ---
[INFO] 51 implicit excludes (use -debug for more details).
[INFO] Exclude: **/*.log
[INFO] Exclude: **/*.css
[INFO] Exclude: **/*.js
[INFO] Exclude: **/*.md
[INFO] Exclude: **/*.eps
[INFO] Exclude: **/*.json
[INFO] Exclude: **/*.parquet
[INFO] Exclude: **/*.sql
[INFO] Exclude: **/git.properties
[INFO] Exclude: **/*.csv
[INFO] Exclude: **/*.tsv
[INFO] Exclude: **/*.txt
[INFO] Exclude: **/drill-*.conf
[INFO] Exclude: **/.buildpath
[INFO] Exclude: **/*.proto
[INFO] Exclude: **/*.fmpp
[INFO] Exclude: **/target/**
[INFO] Exclude: **/*.iml
[INFO] Exclude: **/*.tdd
[INFO] Exclude: **/*.project
[INFO] Exclude: **/TAGS
[INFO] Exclude: **/*.checkstyle
[INFO] Exclude: **/.classpath
[INFO] Exclude: **/.settings/**
[INFO] Exclude: .*/**
[INFO] Exclude: **/*.patch
[INFO] Exclude: **/*.pb.cc
[INFO] Exclude: **/*.pb.h
[INFO] Exclude: **/*.linux
[INFO] Exclude: **/client/build/**
[INFO] Exclude: **/*.tbl
[INFO] 1386 resources included (use -debug for more details)
Warning:  org.apache.xerces.jaxp.SAXParserImpl$JAXPSAXParser: Property 'http://www.oracle.com/xml/jaxp/properties/entityExpansionLimit'
is not recognized.
Compiler warnings:
  WARNING:  'org.apache.xerces.jaxp.SAXParserImpl: Property 'http://javax.xml.XMLConstants/property/accessExternalDTD'
is not recognized.'
Warning:  org.apache.xerces.parsers.SAXParser: Feature 'http://javax.xml.XMLConstants/feature/secure-processing'
is not recognized.
Warning:  org.apache.xerces.parsers.SAXParser: Property 'http://javax.xml.XMLConstants/property/accessExternalDTD'
is not recognized.
Warning:  org.apache.xerces.parsers.SAXParser: Property 'http://www.oracle.com/xml/jaxp/properties/entityExpansionLimit'
is not recognized.
[INFO] Rat check: Summary of files. Unapproved: 0 unknown: 0 generated: 0 approved: 1385 licence.
[INFO] 
[INFO] --- maven-checkstyle-plugin:2.12.1:check (checkstyle-validation) @ drill-java-exec
---
[INFO] Starting audit...
<https://builds.apache.org/job/drill-scm/ws/exec/java-exec/src/test/java/org/apache/drill/TestUnionAll.java>:445:
Line matches the illegal pattern '\s+$'.
Audit done.

[INFO] ------------------------------------------------------------------------
[INFO] Reactor Summary:
[INFO] 
[INFO] Apache Drill Root POM ............................. SUCCESS [31.479s]
[INFO] Drill Protocol .................................... SUCCESS [18.725s]
[INFO] Common (Logical Plan, Base expressions) ........... SUCCESS [33.080s]
[INFO] contrib/Parent Pom ................................ SUCCESS [0.896s]
[INFO] contrib/data/Parent Pom ........................... SUCCESS [0.765s]
[INFO] contrib/data/tpch-sample-data ..................... SUCCESS [10.399s]
[INFO] contrib/data/window-test-data ..................... SUCCESS [2.490s]
[INFO] exec/Parent Pom ................................... SUCCESS [0.775s]
[INFO] exec/Java Execution Engine ........................ FAILURE [51.405s]
[INFO] contrib/hive-storage-plugin/Parent Pom ............ SKIPPED
[INFO] contrib/hive-storage-plugin/hive-exec-shaded ...... SKIPPED
[INFO] contrib/hive-storage-plugin/core .................. SKIPPED
[INFO] exec/JDBC Driver using dependencies ............... SKIPPED
[INFO] JDBC JAR with all dependencies .................... SKIPPED
[INFO] contrib/mongo-storage-plugin ...................... SKIPPED
[INFO] contrib/hbase-storage-plugin ...................... SKIPPED
[INFO] Packaging and Distribution Assembly ............... SKIPPED
[INFO] contrib/sqlline ................................... SKIPPED
[INFO] ------------------------------------------------------------------------
[INFO] BUILD FAILURE
[INFO] ------------------------------------------------------------------------
[INFO] Total time: 2:32.318s
[INFO] Finished at: Fri Apr 10 21:20:55 UTC 2015
[INFO] Final Memory: 62M/223M
[INFO] ------------------------------------------------------------------------
[ERROR] Failed to execute goal org.apache.maven.plugins:maven-checkstyle-plugin:2.12.1:check
(checkstyle-validation) on project drill-java-exec: Failed during checkstyle execution: There
are 1 checkstyle errors. -> [Help 1]
[ERROR] 
[ERROR] To see the full stack trace of the errors, re-run Maven with the -e switch.
[ERROR] Re-run Maven using the -X switch to enable full debug logging.
[ERROR] 
[ERROR] For more information about the errors and possible solutions, please read the following
articles:
[ERROR] [Help 1] http://cwiki.apache.org/confluence/display/MAVEN/MojoExecutionException
[ERROR] 
[ERROR] After correcting the problems, you can resume the build with the command
[ERROR]   mvn <goals> -rf :drill-java-exec
Build step 'Invoke top-level Maven targets' marked build as failure
Archiving artifacts

Mime
View raw message