distributedlog-dev mailing list archives

Site index · List index
Message view « Date » · « Thread »
Top « Date » · « Thread »
From Apache Jenkins Server <jenk...@builds.apache.org>
Subject Build failed in Jenkins: distributedlog-nightly-build #92
Date Thu, 20 Oct 2016 08:27:51 GMT
See <https://builds.apache.org/job/distributedlog-nightly-build/92/>

------------------------------------------
[...truncated 2010 lines...]
[INFO] Downloaded: https://repo.maven.apache.org/maven2/org/apache/maven/surefire/surefire-junit4/2.9/surefire-junit4-2.9.jar
(33 KB at 1917.1 KB/sec)

-------------------------------------------------------
 T E S T S
-------------------------------------------------------

-------------------------------------------------------
 T E S T S
-------------------------------------------------------
Running com.twitter.distributedlog.TestTruncate
Running com.twitter.distributedlog.admin.TestDistributedLogAdmin
Tests run: 1, Failures: 0, Errors: 0, Skipped: 1, Time elapsed: 3.695 sec
Running com.twitter.distributedlog.admin.TestDLCK
Tests run: 1, Failures: 0, Errors: 0, Skipped: 0, Time elapsed: 11.879 sec
Running com.twitter.distributedlog.feature.TestDynamicConfigurationFeatureProvider
Tests run: 3, Failures: 0, Errors: 0, Skipped: 1, Time elapsed: 0.315 sec
Running com.twitter.distributedlog.feature.TestConfigurationFeatureProvider
Tests run: 1, Failures: 0, Errors: 0, Skipped: 0, Time elapsed: 0.168 sec
Running com.twitter.distributedlog.TestRollLogSegments
Tests run: 5, Failures: 0, Errors: 4, Skipped: 0, Time elapsed: 67.157 sec <<< FAILURE!
Running com.twitter.distributedlog.TestBKLogWriteHandler
Tests run: 1, Failures: 0, Errors: 0, Skipped: 0, Time elapsed: 4.442 sec
Running com.twitter.distributedlog.config.TestDynamicConfigurationFactory
Tests run: 3, Failures: 0, Errors: 0, Skipped: 0, Time elapsed: 1.736 sec
Running com.twitter.distributedlog.config.TestDynamicDistributedLogConfiguration
Tests run: 7, Failures: 0, Errors: 0, Skipped: 0, Time elapsed: 0.222 sec
Running com.twitter.distributedlog.config.TestConfigurationSubscription
Tests run: 4, Failures: 0, Errors: 0, Skipped: 0, Time elapsed: 0.535 sec
Running com.twitter.distributedlog.config.TestConcurrentBaseConfiguration
Tests run: 1, Failures: 0, Errors: 0, Skipped: 0, Time elapsed: 0.198 sec
Running com.twitter.distributedlog.TestLogSegmentCreation
Tests run: 1, Failures: 0, Errors: 0, Skipped: 0, Time elapsed: 6.937 sec
Running com.twitter.distributedlog.TestSequenceID
Tests run: 5, Failures: 0, Errors: 0, Skipped: 0, Time elapsed: 22.102 sec
Running com.twitter.distributedlog.TestLedgerHandleCache
Tests run: 10, Failures: 0, Errors: 0, Skipped: 0, Time elapsed: 4.373 sec
Running com.twitter.distributedlog.TestNonBlockingReads
Tests run: 1, Failures: 0, Errors: 0, Skipped: 1, Time elapsed: 0.026 sec
Running com.twitter.distributedlog.impl.TestZKNamespaceWatcher
Tests run: 2, Failures: 0, Errors: 0, Skipped: 0, Time elapsed: 36.371 sec
Running com.twitter.distributedlog.impl.TestZKLogMetadataStore
Tests run: 3, Failures: 0, Errors: 0, Skipped: 0, Time elapsed: 4.236 sec
Running com.twitter.distributedlog.impl.federated.TestFederatedZKLogMetadataStore
Tests run: 11, Failures: 0, Errors: 0, Skipped: 0, Time elapsed: 44.534 sec
Running com.twitter.distributedlog.impl.TestZKLogSegmentMetadataStore
Tests run: 19, Failures: 0, Errors: 0, Skipped: 0, Time elapsed: 9.656 sec
Running com.twitter.distributedlog.impl.metadata.TestZKLogMetadataForWriter
Tests run: 13, Failures: 0, Errors: 0, Skipped: 0, Time elapsed: 4.298 sec
Running com.twitter.distributedlog.impl.metadata.TestZKLogMetadata
Tests run: 1, Failures: 0, Errors: 0, Skipped: 0, Time elapsed: 0.18 sec
Running com.twitter.distributedlog.impl.metadata.TestZKLogMetadataForWriterUtilFunctions
Tests run: 9, Failures: 0, Errors: 0, Skipped: 0, Time elapsed: 0.233 sec
Running com.twitter.distributedlog.impl.TestZKLogSegmentFilters
Tests run: 1, Failures: 0, Errors: 0, Skipped: 0, Time elapsed: 0.174 sec
Running com.twitter.distributedlog.TestDLMTestUtil
Tests run: 1, Failures: 0, Errors: 0, Skipped: 0, Time elapsed: 0.435 sec
Running com.twitter.distributedlog.TestDistributedLogConfiguration
Tests run: 5, Failures: 0, Errors: 0, Skipped: 0, Time elapsed: 0.258 sec
Running com.twitter.distributedlog.util.TestSafeQueueingFuturePool
Tests run: 5, Failures: 0, Errors: 0, Skipped: 0, Time elapsed: 0.42 sec
Running com.twitter.distributedlog.util.TestPermitManager
Tests run: 2, Failures: 0, Errors: 0, Skipped: 0, Time elapsed: 0.187 sec
Running com.twitter.distributedlog.util.TestUtils
Tests run: 2, Failures: 0, Errors: 0, Skipped: 0, Time elapsed: 1.507 sec
Running com.twitter.distributedlog.util.TestDLUtils
Tests run: 13, Failures: 0, Errors: 0, Skipped: 0, Time elapsed: 0.199 sec
Running com.twitter.distributedlog.util.TestConfUtils
Tests run: 1, Failures: 0, Errors: 0, Skipped: 0, Time elapsed: 0.182 sec
Running com.twitter.distributedlog.util.TestFutureUtils
Tests run: 1, Failures: 0, Errors: 0, Skipped: 0, Time elapsed: 0.392 sec
Running com.twitter.distributedlog.util.TestTimeSequencer
Tests run: 1, Failures: 0, Errors: 0, Skipped: 0, Time elapsed: 0.058 sec
Running com.twitter.distributedlog.TestBKDistributedLogNamespace
Tests run: 9, Failures: 0, Errors: 0, Skipped: 0, Time elapsed: 16.759 sec
Running com.twitter.distributedlog.tools.TestDistributedLogTool
Tests run: 12, Failures: 0, Errors: 1, Skipped: 0, Time elapsed: 74.324 sec <<< FAILURE!
Running com.twitter.distributedlog.namespace.TestDistributedLogNamespaceBuilder
Tests run: 10, Failures: 0, Errors: 0, Skipped: 0, Time elapsed: 4.908 sec
Running com.twitter.distributedlog.TestLogSegmentMetadata
Tests run: 6, Failures: 0, Errors: 0, Skipped: 0, Time elapsed: 1.297 sec
Running com.twitter.distributedlog.TestNonBlockingReadsMultiReader
Tests run: 1, Failures: 0, Errors: 1, Skipped: 0, Time elapsed: 63.877 sec <<< FAILURE!
Running com.twitter.distributedlog.TestReadUtils
Tests run: 17, Failures: 0, Errors: 0, Skipped: 0, Time elapsed: 46.708 sec
Running com.twitter.distributedlog.rate.TestMovingAverageRate
Tests run: 2, Failures: 0, Errors: 0, Skipped: 0, Time elapsed: 0.46 sec
Running com.twitter.distributedlog.TestZooKeeperClient
Tests run: 12, Failures: 0, Errors: 0, Skipped: 2, Time elapsed: 8.45 sec
Running com.twitter.distributedlog.limiter.TestRequestLimiter
Tests run: 1, Failures: 0, Errors: 0, Skipped: 0, Time elapsed: 0.077 sec
Running com.twitter.distributedlog.TestBKDistributedLogManager
Tests run: 30, Failures: 0, Errors: 13, Skipped: 0, Time elapsed: 826.484 sec <<<
FAILURE!
Running com.twitter.distributedlog.TestBKLogSegmentWriter
Tests run: 10, Failures: 0, Errors: 0, Skipped: 0, Time elapsed: 14.994 sec
Running com.twitter.distributedlog.zk.TestZKTransaction
Tests run: 2, Failures: 0, Errors: 0, Skipped: 0, Time elapsed: 0.484 sec
Running com.twitter.distributedlog.zk.TestZKWatcherManager
Tests run: 1, Failures: 0, Errors: 0, Skipped: 0, Time elapsed: 0.151 sec
Running com.twitter.distributedlog.zk.TestZKVersionedSetOp
Tests run: 2, Failures: 0, Errors: 0, Skipped: 0, Time elapsed: 0.238 sec
Running com.twitter.distributedlog.bk.TestLedgerAllocatorPool
Tests run: 6, Failures: 0, Errors: 0, Skipped: 0, Time elapsed: 21.466 sec
Running com.twitter.distributedlog.bk.TestLedgerAllocator
Tests run: 9, Failures: 0, Errors: 0, Skipped: 2, Time elapsed: 14.52 sec
Running com.twitter.distributedlog.TestFailureAndRecovery
Tests run: 5, Failures: 0, Errors: 0, Skipped: 0, Time elapsed: 19.094 sec
Running com.twitter.distributedlog.logsegment.TestLogSegmentCache
Tests run: 6, Failures: 0, Errors: 0, Skipped: 0, Time elapsed: 0.23 sec
Running com.twitter.distributedlog.logsegment.TestRollingPolicy
Tests run: 2, Failures: 0, Errors: 0, Skipped: 0, Time elapsed: 0.158 sec
Running com.twitter.distributedlog.TestEnvelopedEntry
Tests run: 2, Failures: 0, Errors: 0, Skipped: 0, Time elapsed: 0.182 sec
Running com.twitter.distributedlog.TestBKSyncLogReader
Tests run: 6, Failures: 0, Errors: 4, Skipped: 0, Time elapsed: 250.818 sec <<< FAILURE!
Running com.twitter.distributedlog.TestWriteLimiter
Tests run: 10, Failures: 0, Errors: 0, Skipped: 0, Time elapsed: 0.149 sec
Running com.twitter.distributedlog.acl.TestZKAccessControl
Tests run: 5, Failures: 0, Errors: 0, Skipped: 0, Time elapsed: 1.709 sec
Running com.twitter.distributedlog.acl.TestZKAccessControlManager
Tests run: 1, Failures: 0, Errors: 0, Skipped: 0, Time elapsed: 3.43 sec
Running com.twitter.distributedlog.TestAppendOnlyStreamReader
Tests run: 5, Failures: 0, Errors: 5, Skipped: 0, Time elapsed: 305.587 sec <<< FAILURE!
Running com.twitter.distributedlog.lock.TestZKSessionLock
Tests run: 29, Failures: 0, Errors: 0, Skipped: 0, Time elapsed: 27.612 sec
Running com.twitter.distributedlog.lock.TestDistributedLock
Tests run: 14, Failures: 0, Errors: 0, Skipped: 0, Time elapsed: 37.532 sec
Running com.twitter.distributedlog.metadata.TestDLMetadata
Tests run: 7, Failures: 0, Errors: 0, Skipped: 0, Time elapsed: 2.497 sec
Running com.twitter.distributedlog.metadata.TestZkMetadataResolver
Tests run: 5, Failures: 0, Errors: 0, Skipped: 0, Time elapsed: 3.583 sec
Running com.twitter.distributedlog.metadata.TestLogSegmentMetadataStoreUpdater
Tests run: 3, Failures: 0, Errors: 0, Skipped: 0, Time elapsed: 2.3 sec
Running com.twitter.distributedlog.net.TestDNSResolver
Tests run: 3, Failures: 0, Errors: 0, Skipped: 0, Time elapsed: 0.167 sec
Running com.twitter.distributedlog.net.TestNetUtils
Tests run: 3, Failures: 0, Errors: 0, Skipped: 0, Time elapsed: 0.184 sec
Running com.twitter.distributedlog.TestBKLogReadHandler
Tests run: 21, Failures: 0, Errors: 0, Skipped: 0, Time elapsed: 76.915 sec
Running com.twitter.distributedlog.TestLogSegmentsZK
Tests run: 4, Failures: 0, Errors: 0, Skipped: 0, Time elapsed: 14.817 sec
Running com.twitter.distributedlog.TestInterleavedReaders
Tests run: 8, Failures: 0, Errors: 6, Skipped: 0, Time elapsed: 386.107 sec <<< FAILURE!
Running com.twitter.distributedlog.TestAsyncReaderLock
Tests run: 11, Failures: 0, Errors: 0, Skipped: 0, Time elapsed: 44.222 sec
Running com.twitter.distributedlog.TestAsyncBulkWrite
Tests run: 6, Failures: 0, Errors: 0, Skipped: 0, Time elapsed: 13.357 sec
Running com.twitter.distributedlog.TestEntry
Tests run: 4, Failures: 0, Errors: 0, Skipped: 0, Time elapsed: 0.51 sec
Running com.twitter.distributedlog.selector.TestLogRecordSelectors
Tests run: 4, Failures: 0, Errors: 0, Skipped: 0, Time elapsed: 0.163 sec
Running com.twitter.distributedlog.TestAppendOnlyStreamWriter
Tests run: 8, Failures: 0, Errors: 5, Skipped: 0, Time elapsed: 324.861 sec <<< FAILURE!
Running com.twitter.distributedlog.TestReadAhead
Tests run: 2, Failures: 0, Errors: 0, Skipped: 0, Time elapsed: 19 sec
Running com.twitter.distributedlog.TestAsyncReaderWriter
Tests run: 43, Failures: 0, Errors: 1, Skipped: 2, Time elapsed: 228.556 sec <<<
FAILURE!

Results :

Tests in error: 
  testUnableToRollLogSegments(com.twitter.distributedlog.TestRollLogSegments): test timed
out after 60000 milliseconds
  testRollingLogSegments(com.twitter.distributedlog.TestRollLogSegments): Induced Exception
at:FP_StartLogSegmentBeforeLedgerCreate
  testLastDLSNInRollingLogSegments(com.twitter.distributedlog.TestRollLogSegments): Induced
Exception at:FP_StartLogSegmentBeforeLedgerCreate
  testCaughtUpReaderOnLogSegmentRolling(com.twitter.distributedlog.TestRollLogSegments): Induced
Exception at:FP_StartLogSegmentBeforeLedgerCreate
  testToolTruncateStream(com.twitter.distributedlog.tools.TestDistributedLogTool): test timed
out after 60000 milliseconds
  testMultiReaders(com.twitter.distributedlog.TestNonBlockingReadsMultiReader): test timed
out after 60000 milliseconds
  testNumberOfTransactions(com.twitter.distributedlog.TestBKDistributedLogManager): test timed
out after 60000 milliseconds
  testContinuousReaders(com.twitter.distributedlog.TestBKDistributedLogManager): test timed
out after 60000 milliseconds
  testMarkEndOfStream(com.twitter.distributedlog.TestBKDistributedLogManager): test timed
out after 60000 milliseconds
  testMarkEndOfStreamOnEmptyStream(com.twitter.distributedlog.TestBKDistributedLogManager):
test timed out after 60000 milliseconds
  testMarkEndOfStreamOnClosedStream(com.twitter.distributedlog.TestBKDistributedLogManager):
test timed out after 60000 milliseconds
  deleteDuringRead(com.twitter.distributedlog.TestBKDistributedLogManager): test timed out
after 60000 milliseconds
  testImmediateFlush(com.twitter.distributedlog.TestBKDistributedLogManager): test timed out
after 60000 milliseconds
  testTruncationValidation(com.twitter.distributedlog.TestBKDistributedLogManager): test timed
out after 60000 milliseconds
  testSimpleRead(com.twitter.distributedlog.TestBKDistributedLogManager): test timed out after
60000 milliseconds
  testNumberOfTransactionsWithInprogressAtEnd(com.twitter.distributedlog.TestBKDistributedLogManager):
test timed out after 60000 milliseconds
  testContinuousReaderBulk(com.twitter.distributedlog.TestBKDistributedLogManager): test timed
out after 60000 milliseconds
  testContinuousReadersWithEmptyLedgers(com.twitter.distributedlog.TestBKDistributedLogManager):
test timed out after 60000 milliseconds
  testNonPartitionedWrites(com.twitter.distributedlog.TestBKDistributedLogManager): test timed
out after 60000 milliseconds
  testReadingFromEmptyLog(com.twitter.distributedlog.TestBKSyncLogReader): test timed out
after 60000 milliseconds
  testReadRecordsWhenReadAheadCatchingUp(com.twitter.distributedlog.TestBKSyncLogReader):
test timed out after 60000 milliseconds
  testReadRecordsWhenReadAheadCatchingUp2(com.twitter.distributedlog.TestBKSyncLogReader):
test timed out after 60000 milliseconds
  testDeletingLogWhileReading(com.twitter.distributedlog.TestBKSyncLogReader): test timed
out after 60000 milliseconds
  testSkipToSkipsBytesWithLargerLogRecords(com.twitter.distributedlog.TestAppendOnlyStreamReader):
test timed out after 60000 milliseconds
  testSkipToSkipsBytesUntilEndOfStream(com.twitter.distributedlog.TestAppendOnlyStreamReader):
test timed out after 60000 milliseconds
  testSkipToreturnsFalseIfPositionDoesNotExistYetForUnSealedStream(com.twitter.distributedlog.TestAppendOnlyStreamReader):
test timed out after 60000 milliseconds
  testSkipToForNoPositionChange(com.twitter.distributedlog.TestAppendOnlyStreamReader): test
timed out after 60000 milliseconds
  testSkipToSkipsBytesWithImmediateFlush(com.twitter.distributedlog.TestAppendOnlyStreamReader):
test timed out after 60000 milliseconds
  testInterleavedReadersWithRollingEdge(com.twitter.distributedlog.TestInterleavedReaders):
test timed out after 60000 milliseconds
  testInterleavedReadersWithRolling(com.twitter.distributedlog.TestInterleavedReaders): test
timed out after 60000 milliseconds
  testInterleavedReadersWithCleanup(com.twitter.distributedlog.TestInterleavedReaders): test
timed out after 60000 milliseconds
  testInterleavedReadersWithRecovery(com.twitter.distributedlog.TestInterleavedReaders): test
timed out after 60000 milliseconds
  testInterleavedReadersWithRollingEdgeUnPartitioned(com.twitter.distributedlog.TestInterleavedReaders):
test timed out after 60000 milliseconds
  testInterleavedReaders(com.twitter.distributedlog.TestInterleavedReaders): test timed out
after 60000 milliseconds
  testPositionUpdatesOnlyAfterWriteCompletion(com.twitter.distributedlog.TestAppendOnlyStreamWriter):
test timed out after 60000 milliseconds
  testBasicReadAndWriteBehavior(com.twitter.distributedlog.TestAppendOnlyStreamWriter): test
timed out after 60000 milliseconds
  testNoOffsetGapAfterSegmentWriterFailure(com.twitter.distributedlog.TestAppendOnlyStreamWriter):
test timed out after 60000 milliseconds
  testOffsetGapAfterSegmentWriterFailure(com.twitter.distributedlog.TestAppendOnlyStreamWriter):
test timed out after 60000 milliseconds
  testWriteFutureDoesNotCompleteUntilWritePersisted(com.twitter.distributedlog.TestAppendOnlyStreamWriter):
test timed out after 60000 milliseconds
  testWriteControlRecord(com.twitter.distributedlog.TestAsyncReaderWriter): test timed out
after 60000 milliseconds

Tests run: 481, Failures: 0, Errors: 40, Skipped: 9

[JENKINS] Recording test results
[INFO] ------------------------------------------------------------------------
[INFO] Reactor Summary:
[INFO] 
[INFO] Apache DistributedLog :: Parent .................... SUCCESS [ 15.513 s]
[INFO] Apache DistributedLog :: Protocol .................. SUCCESS [ 53.334 s]
[INFO] Apache DistributedLog :: Core Library .............. FAILURE [  01:22 h]
[INFO] Apache DistributedLog :: Proxy Client .............. SKIPPED
[INFO] Apache DistributedLog :: Proxy Service ............. SKIPPED
[INFO] Apache DistributedLog :: Benchmark ................. SKIPPED
[INFO] Apache DistributedLog :: Tutorials :: Basics ....... SKIPPED
[INFO] Apache DistributedLog :: Tutorials :: Messaging Tutorial SKIPPED
[INFO] Apache DistributedLog :: Tutorials :: Kafka Tutorial SKIPPED
[INFO] Apache DistributedLog :: Tutorials :: MapReduce Tutorial SKIPPED
[INFO] Apache DistributedLog :: Tutorials ................. SKIPPED
[INFO] ------------------------------------------------------------------------
[INFO] BUILD FAILURE
[INFO] ------------------------------------------------------------------------
[INFO] Total time: 01:23 h
[INFO] Finished at: 2016-10-20T08:27:22+00:00
[INFO] Final Memory: 45M/533M
[INFO] ------------------------------------------------------------------------
Waiting for Jenkins to finish collecting data
[ERROR] Failed to execute goal org.apache.maven.plugins:maven-surefire-plugin:2.9:test (default-test)
on project distributedlog-core: Failure or timeout -> [Help 1]
[ERROR] 
[ERROR] To see the full stack trace of the errors, re-run Maven with the -e switch.
[ERROR] Re-run Maven using the -X switch to enable full debug logging.
[ERROR] 
[ERROR] For more information about the errors and possible solutions, please read the following
articles:
[ERROR] [Help 1] http://cwiki.apache.org/confluence/display/MAVEN/MojoExecutionException
[ERROR] 
[ERROR] After correcting the problems, you can resume the build with the command
[ERROR]   mvn <goals> -rf :distributedlog-core
[JENKINS] Archiving <https://builds.apache.org/job/distributedlog-nightly-build/ws/distributedlog-core/pom.xml>
to com.twitter/distributedlog-core/0.4.0-incubating-SNAPSHOT/distributedlog-core-0.4.0-incubating-SNAPSHOT.pom
[JENKINS] Archiving <https://builds.apache.org/job/distributedlog-nightly-build/ws/distributedlog-tutorials/distributedlog-mapreduce/pom.xml>
to com.twitter/distributedlog-mapreduce/0.4.0-incubating-SNAPSHOT/distributedlog-mapreduce-0.4.0-incubating-SNAPSHOT.pom
[JENKINS] Archiving <https://builds.apache.org/job/distributedlog-nightly-build/ws/distributedlog-client/pom.xml>
to com.twitter/distributedlog-client/0.4.0-incubating-SNAPSHOT/distributedlog-client-0.4.0-incubating-SNAPSHOT.pom
[JENKINS] Archiving <https://builds.apache.org/job/distributedlog-nightly-build/ws/distributedlog-benchmark/pom.xml>
to com.twitter/distributedlog-benchmark/0.4.0-incubating-SNAPSHOT/distributedlog-benchmark-0.4.0-incubating-SNAPSHOT.pom
[JENKINS] Archiving <https://builds.apache.org/job/distributedlog-nightly-build/ws/distributedlog-tutorials/distributedlog-messaging/pom.xml>
to com.twitter/distributedlog-messaging/0.4.0-incubating-SNAPSHOT/distributedlog-messaging-0.4.0-incubating-SNAPSHOT.pom
[JENKINS] Archiving <https://builds.apache.org/job/distributedlog-nightly-build/ws/distributedlog-tutorials/distributedlog-kafka/pom.xml>
to com.twitter/distributedlog-kafka/0.4.0-incubating-SNAPSHOT/distributedlog-kafka-0.4.0-incubating-SNAPSHOT.pom
[JENKINS] Archiving <https://builds.apache.org/job/distributedlog-nightly-build/ws/pom.xml>
to com.twitter/distributedlog/0.4.0-incubating-SNAPSHOT/distributedlog-0.4.0-incubating-SNAPSHOT.pom
[JENKINS] Archiving <https://builds.apache.org/job/distributedlog-nightly-build/ws/distributedlog-service/pom.xml>
to com.twitter/distributedlog-service/0.4.0-incubating-SNAPSHOT/distributedlog-service-0.4.0-incubating-SNAPSHOT.pom
[JENKINS] Archiving <https://builds.apache.org/job/distributedlog-nightly-build/ws/distributedlog-tutorials/distributedlog-basic/pom.xml>
to com.twitter/distributedlog-basic/0.4.0-incubating-SNAPSHOT/distributedlog-basic-0.4.0-incubating-SNAPSHOT.pom
[JENKINS] Archiving <https://builds.apache.org/job/distributedlog-nightly-build/ws/distributedlog-protocol/pom.xml>
to com.twitter/distributedlog-protocol/0.4.0-incubating-SNAPSHOT/distributedlog-protocol-0.4.0-incubating-SNAPSHOT.pom
[JENKINS] Archiving <https://builds.apache.org/job/distributedlog-nightly-build/ws/distributedlog-protocol/target/distributedlog-protocol-0.4.0-incubating-SNAPSHOT.jar>
to com.twitter/distributedlog-protocol/0.4.0-incubating-SNAPSHOT/distributedlog-protocol-0.4.0-incubating-SNAPSHOT.jar
[JENKINS] Archiving <https://builds.apache.org/job/distributedlog-nightly-build/ws/distributedlog-tutorials/pom.xml>
to com.twitter/distributedlog-tutorials/0.4.0-incubating-SNAPSHOT/distributedlog-tutorials-0.4.0-incubating-SNAPSHOT.pom
channel stopped

Mime
View raw message