distributedlog-dev mailing list archives

Site index · List index
Message view « Date » · « Thread »
Top « Date » · « Thread »
From Apache Jenkins Server <jenk...@builds.apache.org>
Subject Build failed in Jenkins: distributedlog-nightly-build #88
Date Sun, 16 Oct 2016 08:24:38 GMT
See <https://builds.apache.org/job/distributedlog-nightly-build/88/>

------------------------------------------
[...truncated 2009 lines...]
[INFO] Downloading: https://repo.maven.apache.org/maven2/org/apache/maven/surefire/surefire-junit4/2.9/surefire-junit4-2.9.jar
[INFO] Downloaded: https://repo.maven.apache.org/maven2/org/apache/maven/surefire/surefire-junit4/2.9/surefire-junit4-2.9.jar
(33 KB at 239.6 KB/sec)

-------------------------------------------------------
 T E S T S
-------------------------------------------------------

-------------------------------------------------------
 T E S T S
-------------------------------------------------------
Running com.twitter.distributedlog.TestZooKeeperClient
Tests run: 12, Failures: 0, Errors: 0, Skipped: 2, Time elapsed: 8.933 sec
Running com.twitter.distributedlog.TestEnvelopedEntry
Tests run: 2, Failures: 0, Errors: 0, Skipped: 0, Time elapsed: 0.201 sec
Running com.twitter.distributedlog.TestFailureAndRecovery
Tests run: 5, Failures: 0, Errors: 0, Skipped: 0, Time elapsed: 20.128 sec
Running com.twitter.distributedlog.TestReadUtils
Tests run: 17, Failures: 0, Errors: 0, Skipped: 0, Time elapsed: 46.637 sec
Running com.twitter.distributedlog.bk.TestLedgerAllocator
Tests run: 9, Failures: 0, Errors: 0, Skipped: 2, Time elapsed: 14.144 sec
Running com.twitter.distributedlog.bk.TestLedgerAllocatorPool
Tests run: 6, Failures: 0, Errors: 0, Skipped: 0, Time elapsed: 23.09 sec
Running com.twitter.distributedlog.TestEntry
Tests run: 4, Failures: 0, Errors: 0, Skipped: 0, Time elapsed: 0.469 sec
Running com.twitter.distributedlog.TestBKLogReadHandler
Tests run: 21, Failures: 0, Errors: 0, Skipped: 0, Time elapsed: 88.893 sec
Running com.twitter.distributedlog.TestSequenceID
Tests run: 5, Failures: 0, Errors: 0, Skipped: 0, Time elapsed: 21.784 sec
Running com.twitter.distributedlog.TestAppendOnlyStreamReader
Tests run: 5, Failures: 0, Errors: 5, Skipped: 0, Time elapsed: 305.153 sec <<< FAILURE!
Running com.twitter.distributedlog.TestTruncate
Running com.twitter.distributedlog.admin.TestDistributedLogAdmin
Tests run: 1, Failures: 0, Errors: 0, Skipped: 1, Time elapsed: 3.397 sec
Running com.twitter.distributedlog.admin.TestDLCK
Tests run: 1, Failures: 0, Errors: 0, Skipped: 0, Time elapsed: 11.371 sec
Running com.twitter.distributedlog.tools.TestDistributedLogTool
Tests run: 12, Failures: 0, Errors: 1, Skipped: 0, Time elapsed: 70.927 sec <<< FAILURE!
Running com.twitter.distributedlog.TestLogSegmentsZK
Tests run: 4, Failures: 0, Errors: 0, Skipped: 0, Time elapsed: 12.123 sec
Running com.twitter.distributedlog.TestReadAhead
Tests run: 2, Failures: 0, Errors: 0, Skipped: 0, Time elapsed: 17.654 sec
Running com.twitter.distributedlog.selector.TestLogRecordSelectors
Tests run: 4, Failures: 0, Errors: 0, Skipped: 0, Time elapsed: 0.173 sec
Running com.twitter.distributedlog.TestNonBlockingReads
Tests run: 1, Failures: 0, Errors: 0, Skipped: 1, Time elapsed: 0.029 sec
Running com.twitter.distributedlog.TestLogSegmentMetadata
Tests run: 6, Failures: 0, Errors: 0, Skipped: 0, Time elapsed: 1.057 sec
Running com.twitter.distributedlog.metadata.TestLogSegmentMetadataStoreUpdater
Tests run: 3, Failures: 0, Errors: 0, Skipped: 0, Time elapsed: 1.856 sec
Running com.twitter.distributedlog.metadata.TestZkMetadataResolver
Tests run: 5, Failures: 0, Errors: 0, Skipped: 0, Time elapsed: 2.403 sec
Running com.twitter.distributedlog.metadata.TestDLMetadata
Tests run: 7, Failures: 0, Errors: 0, Skipped: 0, Time elapsed: 2.018 sec
Running com.twitter.distributedlog.TestBKLogWriteHandler
Tests run: 1, Failures: 0, Errors: 0, Skipped: 0, Time elapsed: 4.23 sec
Running com.twitter.distributedlog.rate.TestMovingAverageRate
Tests run: 2, Failures: 0, Errors: 0, Skipped: 0, Time elapsed: 0.367 sec
Running com.twitter.distributedlog.TestRollLogSegments
Tests run: 5, Failures: 0, Errors: 4, Skipped: 0, Time elapsed: 66.306 sec <<< FAILURE!
Running com.twitter.distributedlog.TestAppendOnlyStreamWriter
Tests run: 8, Failures: 0, Errors: 5, Skipped: 0, Time elapsed: 323.879 sec <<< FAILURE!
Running com.twitter.distributedlog.TestInterleavedReaders
Tests run: 8, Failures: 0, Errors: 3, Skipped: 0, Time elapsed: 214.108 sec <<< FAILURE!
Running com.twitter.distributedlog.TestBKDistributedLogManager
Tests run: 30, Failures: 0, Errors: 13, Skipped: 0, Time elapsed: 816.723 sec <<<
FAILURE!
Running com.twitter.distributedlog.TestLogSegmentCreation
Tests run: 1, Failures: 0, Errors: 0, Skipped: 0, Time elapsed: 6.465 sec
Running com.twitter.distributedlog.net.TestNetUtils
Tests run: 3, Failures: 0, Errors: 0, Skipped: 0, Time elapsed: 0.163 sec
Running com.twitter.distributedlog.net.TestDNSResolver
Tests run: 3, Failures: 0, Errors: 0, Skipped: 0, Time elapsed: 0.142 sec
Running com.twitter.distributedlog.TestBKSyncLogReader
Tests run: 6, Failures: 0, Errors: 4, Skipped: 0, Time elapsed: 249.451 sec <<< FAILURE!
Running com.twitter.distributedlog.zk.TestZKTransaction
Tests run: 2, Failures: 0, Errors: 0, Skipped: 0, Time elapsed: 0.479 sec
Running com.twitter.distributedlog.zk.TestZKWatcherManager
Tests run: 1, Failures: 0, Errors: 0, Skipped: 0, Time elapsed: 0.144 sec
Running com.twitter.distributedlog.zk.TestZKVersionedSetOp
Tests run: 2, Failures: 0, Errors: 0, Skipped: 0, Time elapsed: 0.212 sec
Running com.twitter.distributedlog.config.TestDynamicConfigurationFactory
Tests run: 3, Failures: 0, Errors: 0, Skipped: 0, Time elapsed: 1.634 sec
Running com.twitter.distributedlog.config.TestConcurrentBaseConfiguration
Tests run: 1, Failures: 0, Errors: 0, Skipped: 0, Time elapsed: 0.196 sec
Running com.twitter.distributedlog.config.TestConfigurationSubscription
Tests run: 4, Failures: 0, Errors: 0, Skipped: 0, Time elapsed: 1.232 sec
Running com.twitter.distributedlog.config.TestDynamicDistributedLogConfiguration
Tests run: 7, Failures: 0, Errors: 0, Skipped: 0, Time elapsed: 0.204 sec
Running com.twitter.distributedlog.impl.TestZKLogMetadataStore
Tests run: 3, Failures: 0, Errors: 0, Skipped: 0, Time elapsed: 4.226 sec
Running com.twitter.distributedlog.impl.metadata.TestZKLogMetadata
Tests run: 1, Failures: 0, Errors: 0, Skipped: 0, Time elapsed: 0.177 sec
Running com.twitter.distributedlog.impl.metadata.TestZKLogMetadataForWriterUtilFunctions
Tests run: 9, Failures: 0, Errors: 0, Skipped: 0, Time elapsed: 0.207 sec
Running com.twitter.distributedlog.impl.metadata.TestZKLogMetadataForWriter
Tests run: 13, Failures: 0, Errors: 0, Skipped: 0, Time elapsed: 3.122 sec
Running com.twitter.distributedlog.impl.TestZKLogSegmentMetadataStore
Tests run: 19, Failures: 0, Errors: 0, Skipped: 0, Time elapsed: 8.496 sec
Running com.twitter.distributedlog.impl.TestZKLogSegmentFilters
Tests run: 1, Failures: 0, Errors: 0, Skipped: 0, Time elapsed: 0.174 sec
Running com.twitter.distributedlog.impl.federated.TestFederatedZKLogMetadataStore
Tests run: 11, Failures: 0, Errors: 0, Skipped: 0, Time elapsed: 41.889 sec
Running com.twitter.distributedlog.impl.TestZKNamespaceWatcher
Tests run: 2, Failures: 0, Errors: 0, Skipped: 0, Time elapsed: 35.727 sec
Running com.twitter.distributedlog.TestAsyncReaderLock
Tests run: 11, Failures: 0, Errors: 0, Skipped: 0, Time elapsed: 45.006 sec
Running com.twitter.distributedlog.TestLedgerHandleCache
Tests run: 10, Failures: 0, Errors: 0, Skipped: 0, Time elapsed: 3.777 sec
Running com.twitter.distributedlog.namespace.TestDistributedLogNamespaceBuilder
Tests run: 10, Failures: 0, Errors: 0, Skipped: 0, Time elapsed: 4.129 sec
Running com.twitter.distributedlog.logsegment.TestRollingPolicy
Tests run: 2, Failures: 0, Errors: 0, Skipped: 0, Time elapsed: 0.149 sec
Running com.twitter.distributedlog.logsegment.TestLogSegmentCache
Tests run: 6, Failures: 0, Errors: 0, Skipped: 0, Time elapsed: 0.251 sec
Running com.twitter.distributedlog.acl.TestZKAccessControl
Tests run: 5, Failures: 0, Errors: 0, Skipped: 0, Time elapsed: 1.282 sec
Running com.twitter.distributedlog.acl.TestZKAccessControlManager
Tests run: 1, Failures: 0, Errors: 0, Skipped: 0, Time elapsed: 4.7 sec
Running com.twitter.distributedlog.TestWriteLimiter
Tests run: 10, Failures: 0, Errors: 0, Skipped: 0, Time elapsed: 0.148 sec
Running com.twitter.distributedlog.TestAsyncReaderWriter
Tests run: 43, Failures: 0, Errors: 1, Skipped: 2, Time elapsed: 192.537 sec <<<
FAILURE!
Running com.twitter.distributedlog.TestBKDistributedLogNamespace
Tests run: 9, Failures: 0, Errors: 0, Skipped: 0, Time elapsed: 14.659 sec
Running com.twitter.distributedlog.TestNonBlockingReadsMultiReader
Tests run: 1, Failures: 0, Errors: 1, Skipped: 0, Time elapsed: 63.712 sec <<< FAILURE!
Running com.twitter.distributedlog.TestDLMTestUtil
Tests run: 1, Failures: 0, Errors: 0, Skipped: 0, Time elapsed: 0.448 sec
Running com.twitter.distributedlog.TestAsyncBulkWrite
Tests run: 6, Failures: 0, Errors: 0, Skipped: 0, Time elapsed: 11.831 sec
Running com.twitter.distributedlog.TestBKLogSegmentWriter
Tests run: 10, Failures: 0, Errors: 0, Skipped: 0, Time elapsed: 13.287 sec
Running com.twitter.distributedlog.lock.TestZKSessionLock
Tests run: 29, Failures: 0, Errors: 0, Skipped: 0, Time elapsed: 26.067 sec
Running com.twitter.distributedlog.lock.TestDistributedLock
Tests run: 14, Failures: 0, Errors: 0, Skipped: 0, Time elapsed: 34.909 sec
Running com.twitter.distributedlog.feature.TestConfigurationFeatureProvider
Tests run: 1, Failures: 0, Errors: 0, Skipped: 0, Time elapsed: 0.165 sec
Running com.twitter.distributedlog.feature.TestDynamicConfigurationFeatureProvider
Tests run: 3, Failures: 0, Errors: 0, Skipped: 1, Time elapsed: 0.291 sec
Running com.twitter.distributedlog.limiter.TestRequestLimiter
Tests run: 1, Failures: 0, Errors: 0, Skipped: 0, Time elapsed: 0.078 sec
Running com.twitter.distributedlog.TestDistributedLogConfiguration
Tests run: 5, Failures: 0, Errors: 0, Skipped: 0, Time elapsed: 0.268 sec
Running com.twitter.distributedlog.util.TestTimeSequencer
Tests run: 1, Failures: 0, Errors: 0, Skipped: 0, Time elapsed: 0.051 sec
Running com.twitter.distributedlog.util.TestUtils
Tests run: 2, Failures: 0, Errors: 0, Skipped: 0, Time elapsed: 1.437 sec
Running com.twitter.distributedlog.util.TestConfUtils
Tests run: 1, Failures: 0, Errors: 0, Skipped: 0, Time elapsed: 0.179 sec
Running com.twitter.distributedlog.util.TestPermitManager
Tests run: 2, Failures: 0, Errors: 0, Skipped: 0, Time elapsed: 0.171 sec
Running com.twitter.distributedlog.util.TestDLUtils
Tests run: 13, Failures: 0, Errors: 0, Skipped: 0, Time elapsed: 0.208 sec
Running com.twitter.distributedlog.util.TestFutureUtils
Tests run: 1, Failures: 0, Errors: 0, Skipped: 0, Time elapsed: 0.395 sec
Running com.twitter.distributedlog.util.TestSafeQueueingFuturePool
Tests run: 5, Failures: 0, Errors: 0, Skipped: 0, Time elapsed: 0.418 sec

Results :

Tests in error: 
  testSkipToSkipsBytesWithLargerLogRecords(com.twitter.distributedlog.TestAppendOnlyStreamReader):
test timed out after 60000 milliseconds
  testSkipToSkipsBytesUntilEndOfStream(com.twitter.distributedlog.TestAppendOnlyStreamReader):
test timed out after 60000 milliseconds
  testSkipToreturnsFalseIfPositionDoesNotExistYetForUnSealedStream(com.twitter.distributedlog.TestAppendOnlyStreamReader):
test timed out after 60000 milliseconds
  testSkipToForNoPositionChange(com.twitter.distributedlog.TestAppendOnlyStreamReader): test
timed out after 60000 milliseconds
  testSkipToSkipsBytesWithImmediateFlush(com.twitter.distributedlog.TestAppendOnlyStreamReader):
test timed out after 60000 milliseconds
  testToolTruncateStream(com.twitter.distributedlog.tools.TestDistributedLogTool): test timed
out after 60000 milliseconds
  testUnableToRollLogSegments(com.twitter.distributedlog.TestRollLogSegments): test timed
out after 60000 milliseconds
  testRollingLogSegments(com.twitter.distributedlog.TestRollLogSegments): Induced Exception
at:FP_StartLogSegmentBeforeLedgerCreate
  testLastDLSNInRollingLogSegments(com.twitter.distributedlog.TestRollLogSegments): Induced
Exception at:FP_StartLogSegmentBeforeLedgerCreate
  testCaughtUpReaderOnLogSegmentRolling(com.twitter.distributedlog.TestRollLogSegments): Induced
Exception at:FP_StartLogSegmentBeforeLedgerCreate
  testOffsetGapAfterSegmentWriterFailure(com.twitter.distributedlog.TestAppendOnlyStreamWriter):
test timed out after 60000 milliseconds
  testNoOffsetGapAfterSegmentWriterFailure(com.twitter.distributedlog.TestAppendOnlyStreamWriter):
test timed out after 60000 milliseconds
  testWriteFutureDoesNotCompleteUntilWritePersisted(com.twitter.distributedlog.TestAppendOnlyStreamWriter):
test timed out after 60000 milliseconds
  testPositionUpdatesOnlyAfterWriteCompletion(com.twitter.distributedlog.TestAppendOnlyStreamWriter):
test timed out after 60000 milliseconds
  testBasicReadAndWriteBehavior(com.twitter.distributedlog.TestAppendOnlyStreamWriter): test
timed out after 60000 milliseconds
  testInterleavedReadersWithRolling(com.twitter.distributedlog.TestInterleavedReaders): test
timed out after 60000 milliseconds
  testInterleavedReadersWithCleanup(com.twitter.distributedlog.TestInterleavedReaders): test
timed out after 60000 milliseconds
  testInterleavedReadersWithRollingEdge(com.twitter.distributedlog.TestInterleavedReaders):
test timed out after 60000 milliseconds
  testNumberOfTransactions(com.twitter.distributedlog.TestBKDistributedLogManager): test timed
out after 60000 milliseconds
  testContinuousReaders(com.twitter.distributedlog.TestBKDistributedLogManager): test timed
out after 60000 milliseconds
  testMarkEndOfStream(com.twitter.distributedlog.TestBKDistributedLogManager): test timed
out after 60000 milliseconds
  testMarkEndOfStreamOnEmptyStream(com.twitter.distributedlog.TestBKDistributedLogManager):
test timed out after 60000 milliseconds
  testMarkEndOfStreamOnClosedStream(com.twitter.distributedlog.TestBKDistributedLogManager):
test timed out after 60000 milliseconds
  deleteDuringRead(com.twitter.distributedlog.TestBKDistributedLogManager): test timed out
after 60000 milliseconds
  testImmediateFlush(com.twitter.distributedlog.TestBKDistributedLogManager): test timed out
after 60000 milliseconds
  testTruncationValidation(com.twitter.distributedlog.TestBKDistributedLogManager): test timed
out after 60000 milliseconds
  testSimpleRead(com.twitter.distributedlog.TestBKDistributedLogManager): test timed out after
60000 milliseconds
  testNumberOfTransactionsWithInprogressAtEnd(com.twitter.distributedlog.TestBKDistributedLogManager):
test timed out after 60000 milliseconds
  testContinuousReaderBulk(com.twitter.distributedlog.TestBKDistributedLogManager): test timed
out after 60000 milliseconds
  testContinuousReadersWithEmptyLedgers(com.twitter.distributedlog.TestBKDistributedLogManager):
test timed out after 60000 milliseconds
  testNonPartitionedWrites(com.twitter.distributedlog.TestBKDistributedLogManager): test timed
out after 60000 milliseconds
  testReadingFromEmptyLog(com.twitter.distributedlog.TestBKSyncLogReader): test timed out
after 60000 milliseconds
  testReadRecordsWhenReadAheadCatchingUp(com.twitter.distributedlog.TestBKSyncLogReader):
test timed out after 60000 milliseconds
  testReadRecordsWhenReadAheadCatchingUp2(com.twitter.distributedlog.TestBKSyncLogReader):
test timed out after 60000 milliseconds
  testDeletingLogWhileReading(com.twitter.distributedlog.TestBKSyncLogReader): test timed
out after 60000 milliseconds
  testWriteControlRecord(com.twitter.distributedlog.TestAsyncReaderWriter): test timed out
after 60000 milliseconds
  testMultiReaders(com.twitter.distributedlog.TestNonBlockingReadsMultiReader): test timed
out after 60000 milliseconds

Tests run: 481, Failures: 0, Errors: 37, Skipped: 9

[JENKINS] Recording test results
[INFO] ------------------------------------------------------------------------
[INFO] Reactor Summary:
[INFO] 
[INFO] Apache DistributedLog :: Parent .................... SUCCESS [ 17.215 s]
[INFO] Apache DistributedLog :: Protocol .................. SUCCESS [ 59.324 s]
[INFO] Apache DistributedLog :: Core Library .............. FAILURE [  01:18 h]
[INFO] Apache DistributedLog :: Proxy Client .............. SKIPPED
[INFO] Apache DistributedLog :: Proxy Service ............. SKIPPED
[INFO] Apache DistributedLog :: Benchmark ................. SKIPPED
[INFO] Apache DistributedLog :: Tutorials :: Basics ....... SKIPPED
[INFO] Apache DistributedLog :: Tutorials :: Messaging Tutorial SKIPPED
[INFO] Apache DistributedLog :: Tutorials :: Kafka Tutorial SKIPPED
[INFO] Apache DistributedLog :: Tutorials :: MapReduce Tutorial SKIPPED
[INFO] Apache DistributedLog :: Tutorials ................. SKIPPED
[INFO] ------------------------------------------------------------------------
[INFO] BUILD FAILURE
[INFO] ------------------------------------------------------------------------
[INFO] Total time: 01:20 h
[INFO] Finished at: 2016-10-16T08:25:13+00:00
[INFO] Final Memory: 44M/409M
[INFO] ------------------------------------------------------------------------
Waiting for Jenkins to finish collecting data[ERROR] Failed to execute goal org.apache.maven.plugins:maven-surefire-plugin:2.9:test
(default-test) on project distributedlog-core: Failure or timeout -> [Help 1]
[ERROR] 
[ERROR] To see the full stack trace of the errors, re-run Maven with the -e switch.
[ERROR] Re-run Maven using the -X switch to enable full debug logging.
[ERROR] 
[ERROR] For more information about the errors and possible solutions, please read the following
articles:
[ERROR] [Help 1] http://cwiki.apache.org/confluence/display/MAVEN/MojoExecutionException
[ERROR] 
[ERROR] After correcting the problems, you can resume the build with the command
[ERROR]   mvn <goals> -rf :distributedlog-core

[JENKINS] Archiving <https://builds.apache.org/job/distributedlog-nightly-build/ws/distributedlog-core/pom.xml>
to com.twitter/distributedlog-core/0.4.0-incubating-SNAPSHOT/distributedlog-core-0.4.0-incubating-SNAPSHOT.pom
[JENKINS] Archiving <https://builds.apache.org/job/distributedlog-nightly-build/ws/distributedlog-tutorials/distributedlog-mapreduce/pom.xml>
to com.twitter/distributedlog-mapreduce/0.4.0-incubating-SNAPSHOT/distributedlog-mapreduce-0.4.0-incubating-SNAPSHOT.pom
[JENKINS] Archiving <https://builds.apache.org/job/distributedlog-nightly-build/ws/distributedlog-client/pom.xml>
to com.twitter/distributedlog-client/0.4.0-incubating-SNAPSHOT/distributedlog-client-0.4.0-incubating-SNAPSHOT.pom
[JENKINS] Archiving <https://builds.apache.org/job/distributedlog-nightly-build/ws/distributedlog-benchmark/pom.xml>
to com.twitter/distributedlog-benchmark/0.4.0-incubating-SNAPSHOT/distributedlog-benchmark-0.4.0-incubating-SNAPSHOT.pom
[JENKINS] Archiving <https://builds.apache.org/job/distributedlog-nightly-build/ws/distributedlog-tutorials/distributedlog-messaging/pom.xml>
to com.twitter/distributedlog-messaging/0.4.0-incubating-SNAPSHOT/distributedlog-messaging-0.4.0-incubating-SNAPSHOT.pom
[JENKINS] Archiving <https://builds.apache.org/job/distributedlog-nightly-build/ws/distributedlog-tutorials/distributedlog-kafka/pom.xml>
to com.twitter/distributedlog-kafka/0.4.0-incubating-SNAPSHOT/distributedlog-kafka-0.4.0-incubating-SNAPSHOT.pom
[JENKINS] Archiving <https://builds.apache.org/job/distributedlog-nightly-build/ws/pom.xml>
to com.twitter/distributedlog/0.4.0-incubating-SNAPSHOT/distributedlog-0.4.0-incubating-SNAPSHOT.pom
No artifacts from distributedlog-nightly-build » Apache DistributedLog :: Parent #87 to compare,
so performing full copy of artifacts
[JENKINS] Archiving <https://builds.apache.org/job/distributedlog-nightly-build/ws/distributedlog-service/pom.xml>
to com.twitter/distributedlog-service/0.4.0-incubating-SNAPSHOT/distributedlog-service-0.4.0-incubating-SNAPSHOT.pom
[JENKINS] Archiving <https://builds.apache.org/job/distributedlog-nightly-build/ws/distributedlog-tutorials/distributedlog-basic/pom.xml>
to com.twitter/distributedlog-basic/0.4.0-incubating-SNAPSHOT/distributedlog-basic-0.4.0-incubating-SNAPSHOT.pom
[JENKINS] Archiving <https://builds.apache.org/job/distributedlog-nightly-build/ws/distributedlog-protocol/pom.xml>
to com.twitter/distributedlog-protocol/0.4.0-incubating-SNAPSHOT/distributedlog-protocol-0.4.0-incubating-SNAPSHOT.pom
[JENKINS] Archiving <https://builds.apache.org/job/distributedlog-nightly-build/ws/distributedlog-protocol/target/distributedlog-protocol-0.4.0-incubating-SNAPSHOT.jar>
to com.twitter/distributedlog-protocol/0.4.0-incubating-SNAPSHOT/distributedlog-protocol-0.4.0-incubating-SNAPSHOT.jar
No artifacts from distributedlog-nightly-build » Apache DistributedLog :: Protocol #87 to
compare, so performing full copy of artifacts
[JENKINS] Archiving <https://builds.apache.org/job/distributedlog-nightly-build/ws/distributedlog-tutorials/pom.xml>
to com.twitter/distributedlog-tutorials/0.4.0-incubating-SNAPSHOT/distributedlog-tutorials-0.4.0-incubating-SNAPSHOT.pom
channel stopped

Mime
View raw message