distributedlog-commits mailing list archives

Site index · List index
Message view « Date » · « Thread »
Top « Date » · « Thread »
From Apache Jenkins Server <jenk...@builds.apache.org>
Subject Build failed in Jenkins: distributedlog-nightly-build #341
Date Tue, 20 Jun 2017 07:01:05 GMT
See <https://builds.apache.org/job/distributedlog-nightly-build/341/display/redirect>

------------------------------------------
Started by timer
[EnvInject] - Loading node environment variables.
ERROR: SEVERE ERROR occurs
org.jenkinsci.lib.envinject.EnvInjectException: java.io.IOException: Remote call on ubuntu-2
failed
	at org.jenkinsci.plugins.envinject.service.EnvironmentVariablesNodeLoader.gatherEnvVarsForNode(EnvironmentVariablesNodeLoader.java:95)
	at org.jenkinsci.plugins.envinject.EnvInjectListener.loadEnvironmentVariablesNode(EnvInjectListener.java:80)
	at org.jenkinsci.plugins.envinject.EnvInjectListener.setUpEnvironment(EnvInjectListener.java:43)
	at hudson.model.AbstractBuild$AbstractBuildExecution.createLauncher(AbstractBuild.java:572)
	at hudson.model.AbstractBuild$AbstractBuildExecution.run(AbstractBuild.java:492)
	at hudson.model.Run.execute(Run.java:1728)
	at hudson.maven.MavenModuleSetBuild.run(MavenModuleSetBuild.java:542)
	at hudson.model.ResourceController.execute(ResourceController.java:98)
	at hudson.model.Executor.run(Executor.java:405)
Caused by: java.io.IOException: Remote call on ubuntu-2 failed
	at hudson.remoting.Channel.call(Channel.java:838)
	at hudson.FilePath.act(FilePath.java:1080)
	at org.jenkinsci.plugins.envinject.service.EnvironmentVariablesNodeLoader.gatherEnvVarsForNode(EnvironmentVariablesNodeLoader.java:64)
	... 8 more
Caused by: java.lang.OutOfMemoryError: GC overhead limit exceeded
	at sun.reflect.ByteVectorImpl.trim(ByteVectorImpl.java:70)
	at sun.reflect.MethodAccessorGenerator.generate(MethodAccessorGenerator.java:388)
	at sun.reflect.MethodAccessorGenerator.generateSerializationConstructor(MethodAccessorGenerator.java:113)
	at sun.reflect.ReflectionFactory.newConstructorForSerialization(ReflectionFactory.java:331)
	at java.io.ObjectStreamClass.getSerializableConstructor(ObjectStreamClass.java:1376)
	at java.io.ObjectStreamClass.access$1500(ObjectStreamClass.java:72)
	at java.io.ObjectStreamClass$2.run(ObjectStreamClass.java:493)
	at java.io.ObjectStreamClass$2.run(ObjectStreamClass.java:468)
	at java.security.AccessController.doPrivileged(Native Method)
	at java.io.ObjectStreamClass.<init>(ObjectStreamClass.java:468)
	at java.io.ObjectStreamClass.lookup(ObjectStreamClass.java:365)
	at java.io.ObjectStreamClass.initNonProxy(ObjectStreamClass.java:602)
	at java.io.ObjectInputStream.readNonProxyDesc(ObjectInputStream.java:1622)
	at java.io.ObjectInputStream.readClassDesc(ObjectInputStream.java:1517)
	at java.io.ObjectInputStream.readNonProxyDesc(ObjectInputStream.java:1622)
	at java.io.ObjectInputStream.readClassDesc(ObjectInputStream.java:1517)
	at java.io.ObjectInputStream.readOrdinaryObject(ObjectInputStream.java:1771)
	at java.io.ObjectInputStream.readObject0(ObjectInputStream.java:1350)
	at java.io.ObjectInputStream.readObject(ObjectInputStream.java:370)
	at hudson.remoting.UserRequest.deserialize(UserRequest.java:217)
	at hudson.remoting.UserRequest.perform(UserRequest.java:131)
	at hudson.remoting.UserRequest.perform(UserRequest.java:50)
	at hudson.remoting.Request$2.run(Request.java:336)
	at hudson.remoting.InterceptingExecutorService$1.call(InterceptingExecutorService.java:68)
	at java.util.concurrent.FutureTask.run(FutureTask.java:262)
	at java.util.concurrent.ThreadPoolExecutor.runWorker(ThreadPoolExecutor.java:1145)
	at java.util.concurrent.ThreadPoolExecutor$Worker.run(ThreadPoolExecutor.java:615)
	at java.lang.Thread.run(Thread.java:745)
	at ......remote call to ubuntu-2(Native Method)
	at hudson.remoting.Channel.attachCallSiteStackTrace(Channel.java:1545)
	at hudson.remoting.UserResponse.retrieve(UserRequest.java:253)
	at hudson.remoting.Channel.call(Channel.java:830)
	... 10 more
ERROR: Step ?JIRA: Update relevant issues? failed: no workspace for distributedlog-nightly-build
#341
[EnvInject] - [ERROR] - SEVERE ERROR occurs: Remote call on ubuntu-2 failed

Mime
View raw message