distributedlog-commits mailing list archives

Site index · List index
Message view « Date » · « Thread »
Top « Date » · « Thread »
From Apache Jenkins Server <jenk...@builds.apache.org>
Subject Build failed in Jenkins: distributedlog-dependency-bookkeeper-nightly-build #155
Date Sun, 07 May 2017 08:33:11 GMT
See <https://builds.apache.org/job/distributedlog-dependency-bookkeeper-nightly-build/155/display/redirect>

------------------------------------------
[...truncated 21.52 KB...]
[INFO] Deleting <https://builds.apache.org/job/distributedlog-dependency-bookkeeper-nightly-build/ws/bookkeeper-server/target>
[INFO] 
[INFO] --- maven-remote-resources-plugin:1.1:process (default) @ bookkeeper-server ---
[INFO] 
[INFO] --- maven-resources-plugin:2.4.3:resources (default-resources) @ bookkeeper-server
---
[INFO] Using 'UTF-8' encoding to copy filtered resources.
[INFO] Copying 3 resources
[INFO] Copying 3 resources
[INFO] 
[INFO] --- maven-compiler-plugin:3.5.1:compile (default-compile) @ bookkeeper-server ---
[INFO] Changes detected - recompiling the module!
[INFO] Compiling 213 source files to <https://builds.apache.org/job/distributedlog-dependency-bookkeeper-nightly-build/ws/bookkeeper-server/target/classes>
[INFO] <https://builds.apache.org/job/distributedlog-dependency-bookkeeper-nightly-build/ws/bookkeeper-server/src/main/java/org/apache/bookkeeper/proto/PerChannelBookieClient.java>:
Some input files use or override a deprecated API.
[INFO] <https://builds.apache.org/job/distributedlog-dependency-bookkeeper-nightly-build/ws/bookkeeper-server/src/main/java/org/apache/bookkeeper/proto/PerChannelBookieClient.java>:
Recompile with -Xlint:deprecation for details.
[INFO] <https://builds.apache.org/job/distributedlog-dependency-bookkeeper-nightly-build/ws/bookkeeper-server/src/main/java/org/apache/bookkeeper/util/OrderedSafeExecutor.java>:
Some input files use unchecked or unsafe operations.
[INFO] <https://builds.apache.org/job/distributedlog-dependency-bookkeeper-nightly-build/ws/bookkeeper-server/src/main/java/org/apache/bookkeeper/util/OrderedSafeExecutor.java>:
Recompile with -Xlint:unchecked for details.
[INFO] 
[INFO] --- maven-resources-plugin:2.4.3:testResources (default-testResources) @ bookkeeper-server
---
[INFO] Using 'UTF-8' encoding to copy filtered resources.
[INFO] Copying 1 resource
[INFO] Copying 3 resources
[INFO] 
[INFO] --- maven-compiler-plugin:3.5.1:testCompile (default-testCompile) @ bookkeeper-server
---
[INFO] Changes detected - recompiling the module!
[INFO] Compiling 100 source files to <https://builds.apache.org/job/distributedlog-dependency-bookkeeper-nightly-build/ws/bookkeeper-server/target/test-classes>
[INFO] <https://builds.apache.org/job/distributedlog-dependency-bookkeeper-nightly-build/ws/bookkeeper-server/src/test/java/org/apache/bookkeeper/test/ZooKeeperUtil.java>:
Some input files use or override a deprecated API.
[INFO] <https://builds.apache.org/job/distributedlog-dependency-bookkeeper-nightly-build/ws/bookkeeper-server/src/test/java/org/apache/bookkeeper/test/ZooKeeperUtil.java>:
Recompile with -Xlint:deprecation for details.
[INFO] 
[INFO] --- maven-surefire-plugin:2.9:test (default-test) @ bookkeeper-server ---
[INFO] Surefire report directory: <https://builds.apache.org/job/distributedlog-dependency-bookkeeper-nightly-build/ws/bookkeeper-server/target/surefire-reports>

-------------------------------------------------------
 T E S T S
-------------------------------------------------------

-------------------------------------------------------
 T E S T S
-------------------------------------------------------
Running org.apache.bookkeeper.proto.TestBKStats
Tests run: 1, Failures: 0, Errors: 0, Skipped: 0, Time elapsed: 0.163 sec
Running org.apache.bookkeeper.proto.TestPerChannelBookieClient
Tests run: 5, Failures: 0, Errors: 0, Skipped: 0, Time elapsed: 11.811 sec
Running org.apache.bookkeeper.net.TestNetworkTopology
Tests run: 3, Failures: 0, Errors: 0, Skipped: 0, Time elapsed: 9.505 sec
Running org.apache.bookkeeper.zookeeper.TestZooKeeperClient
Tests run: 4, Failures: 0, Errors: 0, Skipped: 0, Time elapsed: 44.416 sec
Running org.apache.bookkeeper.zookeeper.TestRetryPolicy
Tests run: 2, Failures: 0, Errors: 0, Skipped: 0, Time elapsed: 0.139 sec
Running org.apache.bookkeeper.bookie.BookieJournalTest
Tests run: 13, Failures: 0, Errors: 0, Skipped: 0, Time elapsed: 2.149 sec
Running org.apache.bookkeeper.bookie.EntryLogTest
Tests run: 15, Failures: 0, Errors: 0, Skipped: 0, Time elapsed: 1.772 sec
Running org.apache.bookkeeper.bookie.IndexCorruptionTest
Tests run: 8, Failures: 0, Errors: 0, Skipped: 0, Time elapsed: 34.786 sec
Running org.apache.bookkeeper.bookie.GarbageCollectionTest
Tests run: 1, Failures: 0, Errors: 0, Skipped: 0, Time elapsed: 7.397 sec
Running org.apache.bookkeeper.bookie.IndexPersistenceMgrTest
Tests run: 6, Failures: 0, Errors: 0, Skipped: 0, Time elapsed: 4.774 sec
Running org.apache.bookkeeper.bookie.CompactionByEntriesTest
Tests run: 9, Failures: 0, Errors: 0, Skipped: 0, Time elapsed: 57.44 sec
Running org.apache.bookkeeper.bookie.CompactionByBytesTest
Tests run: 9, Failures: 0, Errors: 0, Skipped: 0, Time elapsed: 57.065 sec
Running org.apache.bookkeeper.bookie.TestSkipListArena
Tests run: 3, Failures: 0, Errors: 0, Skipped: 0, Time elapsed: 0.595 sec
Running org.apache.bookkeeper.bookie.TestEntryMemTable
Tests run: 6, Failures: 0, Errors: 0, Skipped: 0, Time elapsed: 0.776 sec
Running org.apache.bookkeeper.bookie.UpgradeTest
Tests run: 4, Failures: 0, Errors: 0, Skipped: 0, Time elapsed: 4.322 sec
Running org.apache.bookkeeper.bookie.CookieTest
Tests run: 10, Failures: 0, Errors: 0, Skipped: 0, Time elapsed: 4.383 sec
Running org.apache.bookkeeper.bookie.BookieThreadTest
Tests run: 1, Failures: 0, Errors: 0, Skipped: 0, Time elapsed: 0.417 sec
Running org.apache.bookkeeper.bookie.BookieInitializationTest
Tests run: 12, Failures: 0, Errors: 0, Skipped: 0, Time elapsed: 24.52 sec
Running org.apache.bookkeeper.bookie.TestEntryLogMetadataManager
Tests run: 3, Failures: 0, Errors: 0, Skipped: 0, Time elapsed: 0.199 sec
Running org.apache.bookkeeper.bookie.LedgerCacheTest
Running org.apache.bookkeeper.metastore.TestMetaStore
Tests run: 5, Failures: 0, Errors: 0, Skipped: 0, Time elapsed: 0.477 sec
Running org.apache.bookkeeper.util.TestDiskChecker
Tests run: 4, Failures: 0, Errors: 0, Skipped: 0, Time elapsed: 0.336 sec
Running org.apache.bookkeeper.test.ReadOnlyBookieTest
Tests run: 7, Failures: 0, Errors: 0, Skipped: 0, Time elapsed: 19.883 sec
Running org.apache.bookkeeper.test.BookieFailureTest
Tests run: 8, Failures: 0, Errors: 0, Skipped: 0, Time elapsed: 24.733 sec
Running org.apache.bookkeeper.test.ConfigurationTest
Tests run: 2, Failures: 0, Errors: 0, Skipped: 0, Time elapsed: 0.647 sec
Running org.apache.bookkeeper.test.BookieJournalRollingTest
Tests run: 3, Failures: 0, Errors: 0, Skipped: 0, Time elapsed: 45.657 sec
Running org.apache.bookkeeper.test.LedgerCreateDeleteTest
Tests run: 1, Failures: 0, Errors: 0, Skipped: 0, Time elapsed: 4.625 sec
Running org.apache.bookkeeper.test.AsyncLedgerOpsTest
Tests run: 4, Failures: 0, Errors: 0, Skipped: 0, Time elapsed: 11.073 sec
Running org.apache.bookkeeper.test.LedgerDeleteTest
Tests run: 4, Failures: 0, Errors: 0, Skipped: 0, Time elapsed: 57.48 sec
Running org.apache.bookkeeper.test.MultipleThreadReadTest
Tests run: 3, Failures: 0, Errors: 0, Skipped: 0, Time elapsed: 27.772 sec
Running org.apache.bookkeeper.test.ConditionalSetTest
Tests run: 2, Failures: 0, Errors: 0, Skipped: 0, Time elapsed: 3.933 sec
Running org.apache.bookkeeper.test.BookieZKExpireTest
Tests run: 1, Failures: 0, Errors: 0, Skipped: 0, Time elapsed: 25.058 sec
Running org.apache.bookkeeper.test.BookieReadWriteTest
Tests run: 56, Failures: 0, Errors: 0, Skipped: 0, Time elapsed: 319.051 sec
Running org.apache.bookkeeper.test.CloseTest
Tests run: 4, Failures: 0, Errors: 0, Skipped: 0, Time elapsed: 11.725 sec
Running org.apache.bookkeeper.test.ConcurrentLedgerTest
Tests run: 1, Failures: 0, Errors: 0, Skipped: 0, Time elapsed: 0.668 sec
Running org.apache.bookkeeper.test.BookieClientTest
Tests run: 2, Failures: 0, Errors: 0, Skipped: 0, Time elapsed: 1.519 sec
Running org.apache.bookkeeper.client.TestLedgerChecker
Tests run: 11, Failures: 0, Errors: 0, Skipped: 0, Time elapsed: 12.074 sec
Running org.apache.bookkeeper.client.TestReadEntryListener
Tests run: 8, Failures: 0, Errors: 0, Skipped: 0, Time elapsed: 18.13 sec
Running org.apache.bookkeeper.client.TestReadLastConfirmedAndEntry
Tests run: 2, Failures: 0, Errors: 0, Skipped: 0, Time elapsed: 10.81 sec
Running org.apache.bookkeeper.client.TestSpeculativeRead
Tests run: 18, Failures: 0, Errors: 0, Skipped: 0, Time elapsed: 53.048 sec
Running org.apache.bookkeeper.client.TestReadTimeout
Tests run: 1, Failures: 0, Errors: 0, Skipped: 0, Time elapsed: 19.764 sec
Running org.apache.bookkeeper.client.TestRackawareEnsemblePlacementPolicy
Tests run: 13, Failures: 0, Errors: 0, Skipped: 0, Time elapsed: 1.454 sec
Running org.apache.bookkeeper.client.TestReadLastConfirmedLongPoll
Tests run: 2, Failures: 0, Errors: 0, Skipped: 0, Time elapsed: 6.837 sec
Running org.apache.bookkeeper.client.BookKeeperTest
Tests run: 10, Failures: 0, Errors: 0, Skipped: 0, Time elapsed: 69.515 sec
Running org.apache.bookkeeper.client.TestParallelRead
Tests run: 5, Failures: 0, Errors: 0, Skipped: 0, Time elapsed: 8.079 sec
Running org.apache.bookkeeper.client.TestDelayEnsembleChange
Tests run: 7, Failures: 0, Errors: 0, Skipped: 0, Time elapsed: 15.597 sec
Running org.apache.bookkeeper.client.TestTryReadLastConfirmed
Tests run: 3, Failures: 0, Errors: 0, Skipped: 0, Time elapsed: 12.797 sec
Running org.apache.bookkeeper.client.BookieWriteLedgerTest
Tests run: 8, Failures: 0, Errors: 0, Skipped: 0, Time elapsed: 32.976 sec
Running org.apache.bookkeeper.client.LedgerCloseTest
Tests run: 4, Failures: 0, Errors: 0, Skipped: 0, Time elapsed: 27.485 sec
Running org.apache.bookkeeper.client.TestWatchEnsembleChange
Tests run: 1, Failures: 0, Errors: 0, Skipped: 0, Time elapsed: 8.931 sec
Running org.apache.bookkeeper.client.BookKeeperCloseTest
Tests run: 9, Failures: 0, Errors: 0, Skipped: 0, Time elapsed: 12.874 sec
Running org.apache.bookkeeper.client.RoundRobinDistributionScheduleTest
Tests run: 2, Failures: 0, Errors: 0, Skipped: 0, Time elapsed: 0.424 sec
Running org.apache.bookkeeper.client.ParallelLedgerRecoveryTest
Tests run: 14, Failures: 0, Errors: 0, Skipped: 0, Time elapsed: 38.574 sec
Running org.apache.bookkeeper.client.TestPiggybackLAC
Tests run: 1, Failures: 0, Errors: 0, Skipped: 0, Time elapsed: 5.202 sec
Running org.apache.bookkeeper.client.BookieRecoveryTest
Tests run: 15, Failures: 0, Errors: 0, Skipped: 0, Time elapsed: 44.033 sec
Running org.apache.bookkeeper.client.TestFencing
Tests run: 14, Failures: 0, Errors: 0, Skipped: 0, Time elapsed: 44.753 sec
Running org.apache.bookkeeper.client.SlowBookieTest
Tests run: 3, Failures: 0, Errors: 0, Skipped: 0, Time elapsed: 31.693 sec
Running org.apache.bookkeeper.client.TestBookieWatcher
Tests run: 2, Failures: 0, Errors: 0, Skipped: 0, Time elapsed: 17.288 sec
Running org.apache.bookkeeper.client.TestDisableEnsembleChange
Tests run: 4, Failures: 0, Errors: 0, Skipped: 0, Time elapsed: 23.927 sec
Running org.apache.bookkeeper.client.TestAddEntryQuorumTimeout
Tests run: 3, Failures: 0, Errors: 0, Skipped: 0, Time elapsed: 10.781 sec
Running org.apache.bookkeeper.client.TestRegionAwareEnsemblePlacementPolicy
Tests run: 30, Failures: 0, Errors: 0, Skipped: 0, Time elapsed: 3.144 sec
Running org.apache.bookkeeper.client.LedgerRecoveryTest
Tests run: 12, Failures: 0, Errors: 0, Skipped: 0, Time elapsed: 28.565 sec
Running org.apache.bookkeeper.client.TestLedgerFragmentReplication
Tests run: 4, Failures: 0, Errors: 0, Skipped: 0, Time elapsed: 11.543 sec
Running org.apache.bookkeeper.client.TestBookKeeperAdmin
Tests run: 1, Failures: 0, Errors: 0, Skipped: 0, Time elapsed: 3.129 sec
Running org.apache.bookkeeper.client.TestSequenceRead
Tests run: 2, Failures: 0, Errors: 0, Skipped: 0, Time elapsed: 7.516 sec
Running org.apache.bookkeeper.replication.AutoRecoveryMainTest
Tests run: 2, Failures: 0, Errors: 0, Skipped: 0, Time elapsed: 4.67 sec
Running org.apache.bookkeeper.replication.AuditorRollingRestartTest
Tests run: 1, Failures: 0, Errors: 0, Skipped: 0, Time elapsed: 7.718 sec
Running org.apache.bookkeeper.replication.AuditorPeriodicCheckTest
Tests run: 2, Failures: 0, Errors: 0, Skipped: 0, Time elapsed: 16.54 sec
Running org.apache.bookkeeper.replication.AuditorLedgerCheckerTest
Tests run: 6, Failures: 0, Errors: 0, Skipped: 0, Time elapsed: 43.552 sec
Running org.apache.bookkeeper.replication.AuditorBookieTest
Tests run: 5, Failures: 0, Errors: 0, Skipped: 0, Time elapsed: 15.998 sec
Running org.apache.bookkeeper.replication.BookieAutoRecoveryTest
Tests run: 5, Failures: 0, Errors: 0, Skipped: 0, Time elapsed: 102.868 sec
Running org.apache.bookkeeper.replication.TestLedgerUnderreplicationManager
Tests run: 14, Failures: 0, Errors: 0, Skipped: 0, Time elapsed: 59.555 sec
Running org.apache.bookkeeper.replication.TestReplicationWorker
Tests run: 20, Failures: 0, Errors: 0, Skipped: 0, Time elapsed: 136.741 sec
Running org.apache.bookkeeper.replication.AuditorPeriodicBookieCheckTest
Tests run: 1, Failures: 0, Errors: 0, Skipped: 0, Time elapsed: 23.972 sec
Running org.apache.bookkeeper.replication.BookieLedgerIndexTest
Tests run: 6, Failures: 0, Errors: 0, Skipped: 0, Time elapsed: 16.329 sec
Running org.apache.bookkeeper.meta.GcLedgersTest
Tests run: 2, Failures: 0, Errors: 0, Skipped: 0, Time elapsed: 2.83 sec
Running org.apache.bookkeeper.meta.LedgerLayoutTest
Tests run: 5, Failures: 0, Errors: 0, Skipped: 0, Time elapsed: 1.267 sec
Running org.apache.bookkeeper.meta.TestLedgerManager
Tests run: 5, Failures: 0, Errors: 0, Skipped: 0, Time elapsed: 4.218 sec
Running org.apache.bookkeeper.meta.TestZkVersion
Tests run: 3, Failures: 0, Errors: 0, Skipped: 0, Time elapsed: 0.059 sec

Results :

Tests run: 508, Failures: 0, Errors: 0, Skipped: 0

[JENKINS] Recording test results
[INFO] ------------------------------------------------------------------------
[INFO] Reactor Summary:
[INFO] 
[INFO] bookkeeper ......................................... SUCCESS [  4.194 s]
[INFO] compability dependencies ........................... SUCCESS [  0.544 s]
[INFO] bookkeeper-server-compat400 ........................ SUCCESS [  9.100 s]
[INFO] bookkeeper-server-compat410 ........................ SUCCESS [  4.711 s]
[INFO] Stats API for bookkeeper ........................... SUCCESS [  3.094 s]
[INFO] bookkeeper-server .................................. FAILURE [  01:02 h]
[INFO] bookkeeper-benchmark ............................... SKIPPED
[INFO] Stats provider for codahale metrics ................ SKIPPED
[INFO] Stats provider for Finagle stats ................... SKIPPED
[INFO] Stats provider for twitter-stats package ........... SKIPPED
[INFO] Stats provider for twitter-ostrich package ......... SKIPPED
[INFO] bookkeeper-stats-providers ......................... SKIPPED
[INFO] ------------------------------------------------------------------------
[INFO] BUILD FAILURE
[INFO] ------------------------------------------------------------------------
[INFO] Total time: 01:02 h
[INFO] Finished at: 2017-05-07T08:33:01+00:00
[INFO] Final Memory: 47M/1171M
[INFO] ------------------------------------------------------------------------
[ERROR] Failed to execute goal org.apache.maven.plugins:maven-surefire-plugin:2.9:test (default-test)
on project bookkeeper-server: Failure or timeout -> [Help 1]
[ERROR] 
[ERROR] To see the full stack trace of the errors, re-run Maven with the -e switch.
[ERROR] Re-run Maven using the -X switch to enable full debug logging.
[ERROR] 
[ERROR] For more information about the errors and possible solutions, please read the following
articles:
[ERROR] [Help 1] http://cwiki.apache.org/confluence/display/MAVEN/MojoExecutionException
[ERROR] 
[ERROR] After correcting the problems, you can resume the build with the command
[ERROR]   mvn <goals> -rf :bookkeeper-server
[JENKINS] Archiving <https://builds.apache.org/job/distributedlog-dependency-bookkeeper-nightly-build/ws/bookkeeper-stats-providers/pom.xml>
to org.apache.bookkeeper/bookkeeper-stats-providers/4.3.6-TWTTR-OSS-SNAPSHOT/bookkeeper-stats-providers-4.3.6-TWTTR-OSS-SNAPSHOT.pom
[JENKINS] Archiving <https://builds.apache.org/job/distributedlog-dependency-bookkeeper-nightly-build/ws/bookkeeper-stats-providers/twitter-finagle-provider/pom.xml>
to org.apache.bookkeeper.stats/twitter-finagle-provider/4.3.6-TWTTR-OSS-SNAPSHOT/twitter-finagle-provider-4.3.6-TWTTR-OSS-SNAPSHOT.pom
[JENKINS] Archiving <https://builds.apache.org/job/distributedlog-dependency-bookkeeper-nightly-build/ws/bookkeeper-stats-providers/codahale-metrics-provider/pom.xml>
to org.apache.bookkeeper.stats/codahale-metrics-provider/4.3.6-TWTTR-OSS-SNAPSHOT/codahale-metrics-provider-4.3.6-TWTTR-OSS-SNAPSHOT.pom
[JENKINS] Archiving <https://builds.apache.org/job/distributedlog-dependency-bookkeeper-nightly-build/ws/bookkeeper-stats-providers/twitter-ostrich-provider/pom.xml>
to org.apache.bookkeeper.stats/twitter-ostrich-provider/4.3.6-TWTTR-OSS-SNAPSHOT/twitter-ostrich-provider-4.3.6-TWTTR-OSS-SNAPSHOT.pom
[JENKINS] Archiving <https://builds.apache.org/job/distributedlog-dependency-bookkeeper-nightly-build/ws/bookkeeper-stats/pom.xml>
to org.apache.bookkeeper.stats/bookkeeper-stats-api/4.3.6-TWTTR-OSS-SNAPSHOT/bookkeeper-stats-api-4.3.6-TWTTR-OSS-SNAPSHOT.pom
[JENKINS] Archiving <https://builds.apache.org/job/distributedlog-dependency-bookkeeper-nightly-build/ws/bookkeeper-stats/target/bookkeeper-stats-api-4.3.6-TWTTR-OSS-SNAPSHOT.jar>
to org.apache.bookkeeper.stats/bookkeeper-stats-api/4.3.6-TWTTR-OSS-SNAPSHOT/bookkeeper-stats-api-4.3.6-TWTTR-OSS-SNAPSHOT.jar
[JENKINS] Archiving <https://builds.apache.org/job/distributedlog-dependency-bookkeeper-nightly-build/ws/bookkeeper-benchmark/pom.xml>
to org.apache.bookkeeper/bookkeeper-benchmark/4.3.6-TWTTR-OSS-SNAPSHOT/bookkeeper-benchmark-4.3.6-TWTTR-OSS-SNAPSHOT.pom
[JENKINS] Archiving <https://builds.apache.org/job/distributedlog-dependency-bookkeeper-nightly-build/ws/bookkeeper-stats-providers/twitter-science-provider/pom.xml>
to org.apache.bookkeeper.stats/twitter-science-provider/4.3.6-TWTTR-OSS-SNAPSHOT/twitter-science-provider-4.3.6-TWTTR-OSS-SNAPSHOT.pom
[JENKINS] Archiving <https://builds.apache.org/job/distributedlog-dependency-bookkeeper-nightly-build/ws/pom.xml>
to org.apache.bookkeeper/bookkeeper/4.3.6-TWTTR-OSS-SNAPSHOT/bookkeeper-4.3.6-TWTTR-OSS-SNAPSHOT.pom
[JENKINS] Archiving <https://builds.apache.org/job/distributedlog-dependency-bookkeeper-nightly-build/ws/compat-deps/pom.xml>
to org.apache.bookkeeper/compat-deps/4.3.6-TWTTR-OSS-SNAPSHOT/compat-deps-4.3.6-TWTTR-OSS-SNAPSHOT.pom
[JENKINS] Archiving <https://builds.apache.org/job/distributedlog-dependency-bookkeeper-nightly-build/ws/compat-deps/bookkeeper-server-compat-4.1.0/pom.xml>
to org.apache.bookkeeper/bookkeeper-server-compat410/4.1.0/bookkeeper-server-compat410-4.1.0.pom
[JENKINS] Archiving <https://builds.apache.org/job/distributedlog-dependency-bookkeeper-nightly-build/ws/compat-deps/bookkeeper-server-compat-4.1.0/target/bookkeeper-server-compat410-4.1.0.jar>
to org.apache.bookkeeper/bookkeeper-server-compat410/4.1.0/bookkeeper-server-compat410-4.1.0.jar
[JENKINS] Archiving <https://builds.apache.org/job/distributedlog-dependency-bookkeeper-nightly-build/ws/compat-deps/bookkeeper-server-compat-4.0.0/pom.xml>
to org.apache.bookkeeper/bookkeeper-server-compat400/4.0.0/bookkeeper-server-compat400-4.0.0.pom
[JENKINS] Archiving <https://builds.apache.org/job/distributedlog-dependency-bookkeeper-nightly-build/ws/compat-deps/bookkeeper-server-compat-4.0.0/target/bookkeeper-server-compat400-4.0.0.jar>
to org.apache.bookkeeper/bookkeeper-server-compat400/4.0.0/bookkeeper-server-compat400-4.0.0.jar
[JENKINS] Archiving <https://builds.apache.org/job/distributedlog-dependency-bookkeeper-nightly-build/ws/bookkeeper-server/pom.xml>
to org.apache.bookkeeper/bookkeeper-server/4.3.6-TWTTR-OSS-SNAPSHOT/bookkeeper-server-4.3.6-TWTTR-OSS-SNAPSHOT.pom
channel stopped

Mime
View raw message