distributedlog-commits mailing list archives

Site index · List index
Message view « Date » · « Thread »
Top « Date » · « Thread »
From Apache Jenkins Server <jenk...@builds.apache.org>
Subject Build failed in Jenkins: distributedlog-dependency-bookkeeper-nightly-build #143
Date Fri, 21 Apr 2017 08:30:05 GMT
See <https://builds.apache.org/job/distributedlog-dependency-bookkeeper-nightly-build/143/display/redirect>

------------------------------------------
[...truncated 21.79 KB...]
[INFO] 
[INFO] --- maven-remote-resources-plugin:1.1:process (default) @ bookkeeper-server ---
[INFO] 
[INFO] --- maven-resources-plugin:2.4.3:resources (default-resources) @ bookkeeper-server
---
[INFO] Using 'UTF-8' encoding to copy filtered resources.
[INFO] Copying 3 resources
[INFO] Copying 3 resources
[INFO] 
[INFO] --- maven-compiler-plugin:3.5.1:compile (default-compile) @ bookkeeper-server ---
[INFO] Changes detected - recompiling the module!
[INFO] Compiling 213 source files to <https://builds.apache.org/job/distributedlog-dependency-bookkeeper-nightly-build/ws/bookkeeper-server/target/classes>
[INFO] <https://builds.apache.org/job/distributedlog-dependency-bookkeeper-nightly-build/ws/bookkeeper-server/src/main/java/org/apache/bookkeeper/proto/PerChannelBookieClient.java>:
Some input files use or override a deprecated API.
[INFO] <https://builds.apache.org/job/distributedlog-dependency-bookkeeper-nightly-build/ws/bookkeeper-server/src/main/java/org/apache/bookkeeper/proto/PerChannelBookieClient.java>:
Recompile with -Xlint:deprecation for details.
[INFO] <https://builds.apache.org/job/distributedlog-dependency-bookkeeper-nightly-build/ws/bookkeeper-server/src/main/java/org/apache/bookkeeper/util/OrderedSafeExecutor.java>:
Some input files use unchecked or unsafe operations.
[INFO] <https://builds.apache.org/job/distributedlog-dependency-bookkeeper-nightly-build/ws/bookkeeper-server/src/main/java/org/apache/bookkeeper/util/OrderedSafeExecutor.java>:
Recompile with -Xlint:unchecked for details.
[INFO] 
[INFO] --- maven-resources-plugin:2.4.3:testResources (default-testResources) @ bookkeeper-server
---
[INFO] Using 'UTF-8' encoding to copy filtered resources.
[INFO] Copying 1 resource
[INFO] Copying 3 resources
[INFO] 
[INFO] --- maven-compiler-plugin:3.5.1:testCompile (default-testCompile) @ bookkeeper-server
---
[INFO] Changes detected - recompiling the module!
[INFO] Compiling 100 source files to <https://builds.apache.org/job/distributedlog-dependency-bookkeeper-nightly-build/ws/bookkeeper-server/target/test-classes>
[INFO] <https://builds.apache.org/job/distributedlog-dependency-bookkeeper-nightly-build/ws/bookkeeper-server/src/test/java/org/apache/bookkeeper/test/ZooKeeperUtil.java>:
Some input files use or override a deprecated API.
[INFO] <https://builds.apache.org/job/distributedlog-dependency-bookkeeper-nightly-build/ws/bookkeeper-server/src/test/java/org/apache/bookkeeper/test/ZooKeeperUtil.java>:
Recompile with -Xlint:deprecation for details.
[INFO] 
[INFO] --- maven-surefire-plugin:2.9:test (default-test) @ bookkeeper-server ---
[INFO] Surefire report directory: <https://builds.apache.org/job/distributedlog-dependency-bookkeeper-nightly-build/ws/bookkeeper-server/target/surefire-reports>

-------------------------------------------------------
 T E S T S
-------------------------------------------------------

-------------------------------------------------------
 T E S T S
-------------------------------------------------------
Running org.apache.bookkeeper.net.TestNetworkTopology
Tests run: 3, Failures: 0, Errors: 0, Skipped: 0, Time elapsed: 9.293 sec
Running org.apache.bookkeeper.client.LedgerCloseTest
Tests run: 4, Failures: 0, Errors: 0, Skipped: 0, Time elapsed: 23.017 sec
Running org.apache.bookkeeper.client.TestSequenceRead
Tests run: 2, Failures: 0, Errors: 0, Skipped: 0, Time elapsed: 5.12 sec
Running org.apache.bookkeeper.client.TestSpeculativeRead
Tests run: 18, Failures: 0, Errors: 0, Skipped: 0, Time elapsed: 44.689 sec
Running org.apache.bookkeeper.client.TestReadEntryListener
Tests run: 8, Failures: 0, Errors: 0, Skipped: 0, Time elapsed: 13.09 sec
Running org.apache.bookkeeper.client.ParallelLedgerRecoveryTest
Tests run: 14, Failures: 0, Errors: 0, Skipped: 0, Time elapsed: 34.8 sec
Running org.apache.bookkeeper.client.TestBookieWatcher
Tests run: 2, Failures: 0, Errors: 0, Skipped: 0, Time elapsed: 15.97 sec
Running org.apache.bookkeeper.client.SlowBookieTest
Tests run: 3, Failures: 0, Errors: 0, Skipped: 0, Time elapsed: 27.149 sec
Running org.apache.bookkeeper.client.TestPiggybackLAC
Tests run: 1, Failures: 0, Errors: 0, Skipped: 0, Time elapsed: 3.278 sec
Running org.apache.bookkeeper.client.TestParallelRead
Tests run: 5, Failures: 0, Errors: 0, Skipped: 0, Time elapsed: 5.663 sec
Running org.apache.bookkeeper.client.BookieRecoveryTest
Tests run: 15, Failures: 0, Errors: 0, Skipped: 0, Time elapsed: 38.181 sec
Running org.apache.bookkeeper.client.TestAddEntryQuorumTimeout
Tests run: 3, Failures: 0, Errors: 0, Skipped: 0, Time elapsed: 10.327 sec
Running org.apache.bookkeeper.client.TestRackawareEnsemblePlacementPolicy
Tests run: 13, Failures: 0, Errors: 0, Skipped: 0, Time elapsed: 0.69 sec
Running org.apache.bookkeeper.client.TestDelayEnsembleChange
Tests run: 7, Failures: 0, Errors: 0, Skipped: 0, Time elapsed: 10.593 sec
Running org.apache.bookkeeper.client.TestTryReadLastConfirmed
Tests run: 3, Failures: 0, Errors: 0, Skipped: 0, Time elapsed: 10.253 sec
Running org.apache.bookkeeper.client.BookKeeperCloseTest
Tests run: 9, Failures: 0, Errors: 0, Skipped: 0, Time elapsed: 8.202 sec
Running org.apache.bookkeeper.client.LedgerRecoveryTest
Tests run: 12, Failures: 0, Errors: 0, Skipped: 0, Time elapsed: 25.716 sec
Running org.apache.bookkeeper.client.BookKeeperTest
Tests run: 10, Failures: 0, Errors: 0, Skipped: 0, Time elapsed: 53.72 sec
Running org.apache.bookkeeper.client.TestReadLastConfirmedAndEntry
Tests run: 2, Failures: 0, Errors: 0, Skipped: 0, Time elapsed: 3.686 sec
Running org.apache.bookkeeper.client.TestLedgerFragmentReplication
Tests run: 4, Failures: 0, Errors: 0, Skipped: 0, Time elapsed: 7.765 sec
Running org.apache.bookkeeper.client.TestDisableEnsembleChange
Tests run: 4, Failures: 0, Errors: 0, Skipped: 0, Time elapsed: 21.553 sec
Running org.apache.bookkeeper.client.TestRegionAwareEnsemblePlacementPolicy
Tests run: 30, Failures: 0, Errors: 0, Skipped: 0, Time elapsed: 1.905 sec
Running org.apache.bookkeeper.client.RoundRobinDistributionScheduleTest
Tests run: 2, Failures: 0, Errors: 0, Skipped: 0, Time elapsed: 0.179 sec
Running org.apache.bookkeeper.client.TestWatchEnsembleChange
Tests run: 1, Failures: 0, Errors: 0, Skipped: 0, Time elapsed: 6.901 sec
Running org.apache.bookkeeper.client.TestLedgerChecker
Tests run: 11, Failures: 0, Errors: 0, Skipped: 0, Time elapsed: 6.51 sec
Running org.apache.bookkeeper.client.TestBookKeeperAdmin
Tests run: 1, Failures: 0, Errors: 0, Skipped: 0, Time elapsed: 2.683 sec
Running org.apache.bookkeeper.client.BookieWriteLedgerTest
Tests run: 8, Failures: 0, Errors: 0, Skipped: 0, Time elapsed: 24.465 sec
Running org.apache.bookkeeper.client.TestReadTimeout
Tests run: 1, Failures: 0, Errors: 0, Skipped: 0, Time elapsed: 17.478 sec
Running org.apache.bookkeeper.client.TestReadLastConfirmedLongPoll
Tests run: 2, Failures: 0, Errors: 0, Skipped: 0, Time elapsed: 4.723 sec
Running org.apache.bookkeeper.client.TestFencing
Tests run: 14, Failures: 0, Errors: 0, Skipped: 0, Time elapsed: 35.401 sec
Running org.apache.bookkeeper.bookie.LedgerCacheTest
Running org.apache.bookkeeper.bookie.BookieJournalTest
Tests run: 13, Failures: 0, Errors: 0, Skipped: 0, Time elapsed: 1.05 sec
Running org.apache.bookkeeper.bookie.IndexCorruptionTest
Tests run: 8, Failures: 0, Errors: 0, Skipped: 0, Time elapsed: 29.187 sec
Running org.apache.bookkeeper.bookie.IndexPersistenceMgrTest
Tests run: 6, Failures: 0, Errors: 0, Skipped: 0, Time elapsed: 4.368 sec
Running org.apache.bookkeeper.bookie.TestEntryMemTable
Tests run: 6, Failures: 0, Errors: 0, Skipped: 0, Time elapsed: 0.331 sec
Running org.apache.bookkeeper.bookie.UpgradeTest
Tests run: 4, Failures: 0, Errors: 0, Skipped: 0, Time elapsed: 2.247 sec
Running org.apache.bookkeeper.bookie.TestEntryLogMetadataManager
Tests run: 3, Failures: 0, Errors: 0, Skipped: 0, Time elapsed: 0.074 sec
Running org.apache.bookkeeper.bookie.BookieThreadTest
Tests run: 1, Failures: 0, Errors: 0, Skipped: 0, Time elapsed: 0.174 sec
Running org.apache.bookkeeper.bookie.EntryLogTest
Tests run: 15, Failures: 0, Errors: 0, Skipped: 0, Time elapsed: 0.7 sec
Running org.apache.bookkeeper.bookie.CookieTest
Tests run: 10, Failures: 0, Errors: 0, Skipped: 0, Time elapsed: 2.401 sec
Running org.apache.bookkeeper.bookie.TestSkipListArena
Tests run: 3, Failures: 0, Errors: 0, Skipped: 0, Time elapsed: 0.245 sec
Running org.apache.bookkeeper.bookie.CompactionByBytesTest
Tests run: 9, Failures: 0, Errors: 0, Skipped: 0, Time elapsed: 55.913 sec
Running org.apache.bookkeeper.bookie.BookieInitializationTest
Tests run: 12, Failures: 0, Errors: 0, Skipped: 0, Time elapsed: 21.686 sec
Running org.apache.bookkeeper.bookie.CompactionByEntriesTest
Tests run: 9, Failures: 0, Errors: 0, Skipped: 0, Time elapsed: 53.184 sec
Running org.apache.bookkeeper.bookie.GarbageCollectionTest
Tests run: 1, Failures: 0, Errors: 0, Skipped: 0, Time elapsed: 4.285 sec
Running org.apache.bookkeeper.util.TestDiskChecker
Tests run: 4, Failures: 0, Errors: 0, Skipped: 0, Time elapsed: 0.272 sec
Running org.apache.bookkeeper.meta.GcLedgersTest
Tests run: 2, Failures: 0, Errors: 0, Skipped: 0, Time elapsed: 1.153 sec
Running org.apache.bookkeeper.meta.TestZkVersion
Tests run: 3, Failures: 0, Errors: 0, Skipped: 0, Time elapsed: 0.055 sec
Running org.apache.bookkeeper.meta.LedgerLayoutTest
Tests run: 5, Failures: 0, Errors: 0, Skipped: 0, Time elapsed: 0.793 sec
Running org.apache.bookkeeper.meta.TestLedgerManager
Tests run: 5, Failures: 0, Errors: 0, Skipped: 0, Time elapsed: 4.946 sec
Running org.apache.bookkeeper.metastore.TestMetaStore
Tests run: 5, Failures: 0, Errors: 0, Skipped: 0, Time elapsed: 0.211 sec
Running org.apache.bookkeeper.zookeeper.TestZooKeeperClient
Tests run: 4, Failures: 0, Errors: 0, Skipped: 0, Time elapsed: 48.577 sec
Running org.apache.bookkeeper.zookeeper.TestRetryPolicy
Tests run: 2, Failures: 0, Errors: 0, Skipped: 0, Time elapsed: 0.079 sec
Running org.apache.bookkeeper.proto.TestPerChannelBookieClient
Tests run: 5, Failures: 0, Errors: 0, Skipped: 0, Time elapsed: 8.343 sec
Running org.apache.bookkeeper.proto.TestBKStats
Tests run: 1, Failures: 0, Errors: 0, Skipped: 0, Time elapsed: 0.133 sec
Running org.apache.bookkeeper.replication.TestReplicationWorker
Tests run: 20, Failures: 0, Errors: 0, Skipped: 0, Time elapsed: 132.399 sec
Running org.apache.bookkeeper.replication.AuditorLedgerCheckerTest
Tests run: 6, Failures: 0, Errors: 0, Skipped: 0, Time elapsed: 40.936 sec
Running org.apache.bookkeeper.replication.AuditorPeriodicCheckTest
Tests run: 2, Failures: 0, Errors: 0, Skipped: 0, Time elapsed: 12.741 sec
Running org.apache.bookkeeper.replication.AuditorPeriodicBookieCheckTest
Tests run: 1, Failures: 0, Errors: 0, Skipped: 0, Time elapsed: 12.261 sec
Running org.apache.bookkeeper.replication.BookieLedgerIndexTest
Tests run: 6, Failures: 0, Errors: 0, Skipped: 0, Time elapsed: 14.86 sec
Running org.apache.bookkeeper.replication.AutoRecoveryMainTest
Tests run: 2, Failures: 0, Errors: 0, Skipped: 0, Time elapsed: 2.767 sec
Running org.apache.bookkeeper.replication.AuditorRollingRestartTest
Tests run: 1, Failures: 0, Errors: 0, Skipped: 0, Time elapsed: 5.783 sec
Running org.apache.bookkeeper.replication.AuditorBookieTest
Tests run: 5, Failures: 0, Errors: 0, Skipped: 0, Time elapsed: 12.174 sec
Running org.apache.bookkeeper.replication.BookieAutoRecoveryTest
Tests run: 5, Failures: 0, Errors: 0, Skipped: 0, Time elapsed: 98.105 sec
Running org.apache.bookkeeper.replication.TestLedgerUnderreplicationManager
Tests run: 14, Failures: 0, Errors: 0, Skipped: 0, Time elapsed: 54.905 sec
Running org.apache.bookkeeper.test.BookieFailureTest
Tests run: 8, Failures: 0, Errors: 0, Skipped: 0, Time elapsed: 18.749 sec
Running org.apache.bookkeeper.test.ReadOnlyBookieTest
Tests run: 7, Failures: 0, Errors: 0, Skipped: 0, Time elapsed: 19.157 sec
Running org.apache.bookkeeper.test.CloseTest
Tests run: 4, Failures: 0, Errors: 0, Skipped: 0, Time elapsed: 8.838 sec
Running org.apache.bookkeeper.test.BookieZKExpireTest
Tests run: 1, Failures: 0, Errors: 0, Skipped: 0, Time elapsed: 24.024 sec
Running org.apache.bookkeeper.test.LedgerDeleteTest
Tests run: 4, Failures: 0, Errors: 0, Skipped: 0, Time elapsed: 49.818 sec
Running org.apache.bookkeeper.test.BookieClientTest
Tests run: 2, Failures: 0, Errors: 0, Skipped: 0, Time elapsed: 0.903 sec
Running org.apache.bookkeeper.test.ConcurrentLedgerTest
Tests run: 1, Failures: 0, Errors: 0, Skipped: 0, Time elapsed: 0.649 sec
Running org.apache.bookkeeper.test.ConfigurationTest
Tests run: 2, Failures: 0, Errors: 0, Skipped: 0, Time elapsed: 0.168 sec
Running org.apache.bookkeeper.test.LedgerCreateDeleteTest
Tests run: 1, Failures: 0, Errors: 0, Skipped: 0, Time elapsed: 3.253 sec
Running org.apache.bookkeeper.test.AsyncLedgerOpsTest
Tests run: 4, Failures: 0, Errors: 0, Skipped: 0, Time elapsed: 9.88 sec
Running org.apache.bookkeeper.test.BookieJournalRollingTest
Tests run: 3, Failures: 0, Errors: 0, Skipped: 0, Time elapsed: 41.19 sec
Running org.apache.bookkeeper.test.BookieReadWriteTest
Tests run: 56, Failures: 0, Errors: 0, Skipped: 0, Time elapsed: 298.712 sec
Running org.apache.bookkeeper.test.ConditionalSetTest
Tests run: 2, Failures: 0, Errors: 0, Skipped: 0, Time elapsed: 2.224 sec
Running org.apache.bookkeeper.test.MultipleThreadReadTest
Tests run: 3, Failures: 0, Errors: 0, Skipped: 0, Time elapsed: 21.507 sec

Results :

Tests run: 508, Failures: 0, Errors: 0, Skipped: 0

[JENKINS] Recording test results
[INFO] ------------------------------------------------------------------------
[INFO] Reactor Summary:
[INFO] 
[INFO] bookkeeper ......................................... SUCCESS [  6.307 s]
[INFO] compability dependencies ........................... SUCCESS [  0.961 s]
[INFO] bookkeeper-server-compat400 ........................ SUCCESS [  9.867 s]
[INFO] bookkeeper-server-compat410 ........................ SUCCESS [  4.311 s]
[INFO] Stats API for bookkeeper ........................... SUCCESS [  4.986 s]
[INFO] bookkeeper-server .................................. FAILURE [58:25 min]
[INFO] bookkeeper-benchmark ............................... SKIPPED
[INFO] Stats provider for codahale metrics ................ SKIPPED
[INFO] Stats provider for Finagle stats ................... SKIPPED
[INFO] Stats provider for twitter-stats package ........... SKIPPED
[INFO] Stats provider for twitter-ostrich package ......... SKIPPED
[INFO] bookkeeper-stats-providers ......................... SKIPPED
[INFO] ------------------------------------------------------------------------
[INFO] BUILD FAILURE
[INFO] ------------------------------------------------------------------------
[INFO] Total time: 59:14 min
[INFO] Finished at: 2017-04-21T08:29:50+00:00
[INFO] Final Memory: 45M/1171M
[INFO] ------------------------------------------------------------------------
Waiting for Jenkins to finish collecting data
[ERROR] Failed to execute goal org.apache.maven.plugins:maven-surefire-plugin:2.9:test (default-test)
on project bookkeeper-server: Failure or timeout -> [Help 1]
[ERROR] 
[ERROR] To see the full stack trace of the errors, re-run Maven with the -e switch.
[ERROR] Re-run Maven using the -X switch to enable full debug logging.
[ERROR] 
[ERROR] For more information about the errors and possible solutions, please read the following
articles:
[ERROR] [Help 1] http://cwiki.apache.org/confluence/display/MAVEN/MojoExecutionException
[ERROR] 
[ERROR] After correcting the problems, you can resume the build with the command
[ERROR]   mvn <goals> -rf :bookkeeper-server
[JENKINS] Archiving <https://builds.apache.org/job/distributedlog-dependency-bookkeeper-nightly-build/ws/bookkeeper-stats-providers/pom.xml>
to org.apache.bookkeeper/bookkeeper-stats-providers/4.3.6-TWTTR-OSS-SNAPSHOT/bookkeeper-stats-providers-4.3.6-TWTTR-OSS-SNAPSHOT.pom
[JENKINS] Archiving <https://builds.apache.org/job/distributedlog-dependency-bookkeeper-nightly-build/ws/bookkeeper-stats-providers/twitter-finagle-provider/pom.xml>
to org.apache.bookkeeper.stats/twitter-finagle-provider/4.3.6-TWTTR-OSS-SNAPSHOT/twitter-finagle-provider-4.3.6-TWTTR-OSS-SNAPSHOT.pom
[JENKINS] Archiving <https://builds.apache.org/job/distributedlog-dependency-bookkeeper-nightly-build/ws/bookkeeper-stats-providers/codahale-metrics-provider/pom.xml>
to org.apache.bookkeeper.stats/codahale-metrics-provider/4.3.6-TWTTR-OSS-SNAPSHOT/codahale-metrics-provider-4.3.6-TWTTR-OSS-SNAPSHOT.pom
[JENKINS] Archiving <https://builds.apache.org/job/distributedlog-dependency-bookkeeper-nightly-build/ws/bookkeeper-stats-providers/twitter-ostrich-provider/pom.xml>
to org.apache.bookkeeper.stats/twitter-ostrich-provider/4.3.6-TWTTR-OSS-SNAPSHOT/twitter-ostrich-provider-4.3.6-TWTTR-OSS-SNAPSHOT.pom
[JENKINS] Archiving <https://builds.apache.org/job/distributedlog-dependency-bookkeeper-nightly-build/ws/bookkeeper-stats/pom.xml>
to org.apache.bookkeeper.stats/bookkeeper-stats-api/4.3.6-TWTTR-OSS-SNAPSHOT/bookkeeper-stats-api-4.3.6-TWTTR-OSS-SNAPSHOT.pom
[JENKINS] Archiving <https://builds.apache.org/job/distributedlog-dependency-bookkeeper-nightly-build/ws/bookkeeper-stats/target/bookkeeper-stats-api-4.3.6-TWTTR-OSS-SNAPSHOT.jar>
to org.apache.bookkeeper.stats/bookkeeper-stats-api/4.3.6-TWTTR-OSS-SNAPSHOT/bookkeeper-stats-api-4.3.6-TWTTR-OSS-SNAPSHOT.jar
[JENKINS] Archiving <https://builds.apache.org/job/distributedlog-dependency-bookkeeper-nightly-build/ws/bookkeeper-benchmark/pom.xml>
to org.apache.bookkeeper/bookkeeper-benchmark/4.3.6-TWTTR-OSS-SNAPSHOT/bookkeeper-benchmark-4.3.6-TWTTR-OSS-SNAPSHOT.pom
[JENKINS] Archiving <https://builds.apache.org/job/distributedlog-dependency-bookkeeper-nightly-build/ws/bookkeeper-stats-providers/twitter-science-provider/pom.xml>
to org.apache.bookkeeper.stats/twitter-science-provider/4.3.6-TWTTR-OSS-SNAPSHOT/twitter-science-provider-4.3.6-TWTTR-OSS-SNAPSHOT.pom
[JENKINS] Archiving <https://builds.apache.org/job/distributedlog-dependency-bookkeeper-nightly-build/ws/pom.xml>
to org.apache.bookkeeper/bookkeeper/4.3.6-TWTTR-OSS-SNAPSHOT/bookkeeper-4.3.6-TWTTR-OSS-SNAPSHOT.pom
[JENKINS] Archiving <https://builds.apache.org/job/distributedlog-dependency-bookkeeper-nightly-build/ws/compat-deps/pom.xml>
to org.apache.bookkeeper/compat-deps/4.3.6-TWTTR-OSS-SNAPSHOT/compat-deps-4.3.6-TWTTR-OSS-SNAPSHOT.pom
[JENKINS] Archiving <https://builds.apache.org/job/distributedlog-dependency-bookkeeper-nightly-build/ws/compat-deps/bookkeeper-server-compat-4.1.0/pom.xml>
to org.apache.bookkeeper/bookkeeper-server-compat410/4.1.0/bookkeeper-server-compat410-4.1.0.pom
[JENKINS] Archiving <https://builds.apache.org/job/distributedlog-dependency-bookkeeper-nightly-build/ws/compat-deps/bookkeeper-server-compat-4.1.0/target/bookkeeper-server-compat410-4.1.0.jar>
to org.apache.bookkeeper/bookkeeper-server-compat410/4.1.0/bookkeeper-server-compat410-4.1.0.jar
[JENKINS] Archiving <https://builds.apache.org/job/distributedlog-dependency-bookkeeper-nightly-build/ws/compat-deps/bookkeeper-server-compat-4.0.0/pom.xml>
to org.apache.bookkeeper/bookkeeper-server-compat400/4.0.0/bookkeeper-server-compat400-4.0.0.pom
[JENKINS] Archiving <https://builds.apache.org/job/distributedlog-dependency-bookkeeper-nightly-build/ws/compat-deps/bookkeeper-server-compat-4.0.0/target/bookkeeper-server-compat400-4.0.0.jar>
to org.apache.bookkeeper/bookkeeper-server-compat400/4.0.0/bookkeeper-server-compat400-4.0.0.jar
[JENKINS] Archiving <https://builds.apache.org/job/distributedlog-dependency-bookkeeper-nightly-build/ws/bookkeeper-server/pom.xml>
to org.apache.bookkeeper/bookkeeper-server/4.3.6-TWTTR-OSS-SNAPSHOT/bookkeeper-server-4.3.6-TWTTR-OSS-SNAPSHOT.pom
channel stopped

Mime
View raw message