directory-users mailing list archives

Site index · List index
Message view « Date » · « Thread »
Top « Date » · « Thread »
From <Carlo.Acco...@ibs-ag.com>
Subject Cannot build from trunk, goal apacheds-interceptors-admin missing dependency
Date Thu, 12 Apr 2012 19:20:55 GMT
Hi. Anyone else getting this error?

The log below is trunk-with-dependencies but I get the same error when trying to build from
./apacheds/trunk

Build environment:
CYGWIN_NT-6.1-WOW64 1.7.9(0.237/5/3) 2011-03-29 10:10 i686 Cygwin
Java 1.6.0_31-b05 64-Bit
Maven 3.0.4

How it was working in the past. The last time I built from trunk was probably a month ago.

#svn checkout http://svn.apache.org/repos/asf/directory/apacheds/trunk-with-dependencies
#cd trunk-with-dependencies
#mvn clean install -e -Dmaven.test.skip

[INFO]
[INFO] ------------------------------------------------------------------------
[INFO] Building ApacheDS AdministrativePoint Interceptor 2.0.0-M7-SNAPSHOT
[INFO] ------------------------------------------------------------------------
[INFO] ------------------------------------------------------------------------
[INFO] Reactor Summary:
[INFO]
[INFO] Apache Directory Project .......................... SUCCESS [0.960s]
[INFO] Apache Directory Checkstyle Configuration ......... SUCCESS [0.490s]
[INFO] Apache Directory JUnit Add-ons .................... SUCCESS [1.460s]
[INFO] Apache Directory Shared ........................... SUCCESS [0.190s]
[INFO] Apache Directory Shared I18n ...................... SUCCESS [0.860s]
[INFO] Apache Directory Shared Utilities ................. SUCCESS [1.290s]
[INFO] Apache Directory Shared ASN.1 Parent .............. SUCCESS [0.040s]
[INFO] Apache Directory Shared ASN.1 API ................. SUCCESS [0.910s]
[INFO] Apache Directory Shared ASN.1 BER ................. SUCCESS [0.870s]
[INFO] Apache Directory Shared LDAP Parent ............... SUCCESS [0.040s]
[INFO] Apache Directory Shared LDAP Model ................ SUCCESS [8.350s]
[INFO] Apache Directory Shared LDAP Codec Parent ......... SUCCESS [0.070s]
[INFO] Apache Directory Shared LDAP Codec ................ SUCCESS [2.530s]
[INFO] Apache Directory Shared LDAP Net Parent ........... SUCCESS [0.070s]
[INFO] Apache Directory Shared LDAP Network MINA ......... SUCCESS [0.750s]
[INFO] Apache Directory Shared LDAP Codec Standalone ..... SUCCESS [0.600s]
[INFO] Apache Directory Shared DSML Parent ............... SUCCESS [0.080s]
[INFO] Apache Directory Shared DSML Parser ............... SUCCESS [2.956s]
[INFO] Apache Directory Shared LDAP Extras ............... SUCCESS [0.060s]
[INFO] Apache Directory Shared LDAP Extras ACI ........... SUCCESS [1.800s]
[INFO] Apache Directory Shared LDAP Schema Parent ........ SUCCESS [0.040s]
[INFO] Apache Directory Shared LDAP Schema ............... SUCCESS [7.622s]
[INFO] Apache Directory Shared LDAP Client Parent ........ SUCCESS [0.040s]
[INFO] Apache Directory Shared LDAP Client API ........... SUCCESS [1.410s]
[INFO] Apache Directory Shared DSML Engine ............... SUCCESS [0.960s]
[INFO] Apache Directory Shared LDAP Extras Codec API ..... SUCCESS [0.950s]
[INFO] Apache Directory Shared LDAP Extras Codec ......... SUCCESS [2.170s]
[INFO] Apache Directory Shared LDAP Extras Util .......... SUCCESS [0.750s]
[INFO] Apache Directory Shared LDAP Extras Stored Procedures  SUCCESS [0.750s]
[INFO] Apache Directory Shared LDAP Extras Trigger ....... SUCCESS [1.220s]
[INFO] Apache Directory Shared LDAP Schema Converter ..... SUCCESS [1.160s]
[INFO] Apache Directory Shared All ....................... SUCCESS [19.604s]
[INFO] Apache Directory Shared LDAP Client All ........... SUCCESS [2.670s]
[INFO] Apache Directory Shared Integration Tests ......... SUCCESS [1.750s]
[INFO] Apache Directory LDAP API Distribution ............ SUCCESS [0.070s]
[INFO] ApacheDS .......................................... SUCCESS [0.110s]
[INFO] ApacheDS I18n ..................................... SUCCESS [0.780s]
[INFO] ApacheDS Core Constants ........................... SUCCESS [0.510s]
[INFO] ApacheDS Core API ................................. SUCCESS [3.346s]
[INFO] ApacheDS Core Shared .............................. SUCCESS [1.160s]
[INFO] ApacheDS Interceptors ............................. SUCCESS [0.040s]
[INFO] ApacheDS AdministrativePoint Interceptor .......... FAILURE [0.020s]
[INFO] ApacheDS Authentication Interceptor ............... SKIPPED
[INFO] ApacheDS Authorization Interceptor ................ SKIPPED
[INFO] ApacheDS ChangeLog Interceptor .................... SKIPPED
[INFO] ApacheDS Collective Attribute Interceptor ......... SKIPPED
[INFO] ApacheDS Event Interceptor ........................ SKIPPED
[INFO] ApacheDS Exception Interceptor .................... SKIPPED
[INFO] ApacheDS Journal Interceptor ...................... SKIPPED
[INFO] ApacheDS Normalization Interceptor ................ SKIPPED
[INFO] ApacheDS Operational Attribute Interceptor ........ SKIPPED
[INFO] ApacheDS Referral Interceptor ..................... SKIPPED
[INFO] ApacheDS Schema Interceptor ....................... SKIPPED
[INFO] ApacheDS Subtree Interceptor ...................... SKIPPED
[INFO] ApacheDS Triggers Interceptor ..................... SKIPPED
[INFO] ApacheDS Core ..................................... SKIPPED
[INFO] ApacheDS Core AVL ................................. SKIPPED
[INFO] ApacheDS Generalized (X) DBM Partition ............ SKIPPED
[INFO] ApacheDS LDIF Partition ........................... SKIPPED
[INFO] ApacheDS JDBM Partition ........................... SKIPPED
[INFO] ApacheDS Core Annotations ......................... SKIPPED
[INFO] ApacheDS Core JNDI ................................ SKIPPED
[INFO] ApacheDS Protocol Shared .......................... SKIPPED
[INFO] ApacheDS Protocol Kerberos Codec .................. SKIPPED
[INFO] ApacheDS Interceptors for Kerberos ................ SKIPPED
[INFO] ApacheDS Protocol Dhcp ............................ SKIPPED
[INFO] ApacheDS Protocol Dns ............................. SKIPPED
[INFO] ApacheDS Protocol Kerberos ........................ SKIPPED
[INFO] ApacheDS Protocol Ldap ............................ SKIPPED
[INFO] ApacheDS Protocol Ntp ............................. SKIPPED
[INFO] Apacheds Server Annotations ....................... SKIPPED
[INFO] ApacheDS Server Config ............................ SKIPPED
[INFO] ApacheDS Server JNDI .............................. SKIPPED
[INFO] ApacheDS Server Replication Service ............... SKIPPED
[INFO] ApacheDS Test Framework ........................... SKIPPED
[INFO] ApacheDS Generalized (X) DBM Tools ................ SKIPPED
[INFO] ApacheDS All ...................................... SKIPPED
[INFO] ApacheDS Logger Interceptor ....................... SKIPPED
[INFO] ApacheDS Password Hashing Interceptor ............. SKIPPED
[INFO] ApacheDS Core Integration ......................... SKIPPED
[INFO] ApacheDS Server Integration ....................... SKIPPED
[INFO] ApacheDS DirectoryService-WebApp bridge ........... SKIPPED
[INFO] ApacheDS Jetty HTTP Server Integration ............ SKIPPED
[INFO] ApacheDS Service Builder .......................... SKIPPED
[INFO] ApacheDS Protocol Kerberos Test ................... SKIPPED
[INFO] Apache Directory LDAP Client API test ............. SKIPPED
[INFO] ApacheDS Service .................................. SKIPPED
[INFO] ApacheDS Wrapper .................................. SKIPPED
[INFO] ApacheDS Installers Maven Plugin .................. SKIPPED
[INFO] ApacheDS Installers ............................... SKIPPED
[INFO] ApacheDS Manuals .................................. SKIPPED
[INFO] ApacheDS Build With Dependencies .................. SKIPPED
[INFO] ------------------------------------------------------------------------
[INFO] BUILD FAILURE
[INFO] ------------------------------------------------------------------------
[INFO] Total time: 1:13.128s
[INFO] Finished at: Thu Apr 12 15:13:33 EDT 2012
[INFO] Final Memory: 91M/360M
[INFO] ------------------------------------------------------------------------
[ERROR] Failed to execute goal on project apacheds-interceptors-admin: Could not resolve dependencies
for project org.apache.dir
ectory.server:apacheds-interceptors-admin:bundle:2.0.0-M7-SNAPSHOT: Failure to find org.apache.directory.server:apacheds-core-ap
i:jar:tests:2.0.0-M7-SNAPSHOT in https://repository.apache.org/content/repositories/snapshots/
was cached in the local repositor
y, resolution will not be reattempted until the update interval of apache.snapshots has elapsed
or updates are forced -> [Help 1
]
org.apache.maven.lifecycle.LifecycleExecutionException: Failed to execute goal on project
apacheds-interceptors-admin: Could not
resolve dependencies for project org.apache.directory.server:apacheds-interceptors-admin:bundle:2.0.0-M7-SNAPSHOT:
Failure to f
ind org.apache.directory.server:apacheds-core-api:jar:tests:2.0.0-M7-SNAPSHOT in https://repository.apache.org/content/repositor
ies/snapshots/ was cached in the local repository, resolution will not be reattempted until
the update interval of apache.snapsh
ots has elapsed or updates are forced
        at org.apache.maven.lifecycle.internal.LifecycleDependencyResolver.getDependencies(LifecycleDependencyResolver.java:210)

        at org.apache.maven.lifecycle.internal.LifecycleDependencyResolver.resolveProjectDependencies(LifecycleDependencyResolve
r.java:117)
        at org.apache.maven.lifecycle.internal.MojoExecutor.ensureDependenciesAreResolved(MojoExecutor.java:258)
        at org.apache.maven.lifecycle.internal.MojoExecutor.execute(MojoExecutor.java:201)
        at org.apache.maven.lifecycle.internal.MojoExecutor.execute(MojoExecutor.java:153)
        at org.apache.maven.lifecycle.internal.MojoExecutor.execute(MojoExecutor.java:145)
        at org.apache.maven.lifecycle.internal.LifecycleModuleBuilder.buildProject(LifecycleModuleBuilder.java:84)
        at org.apache.maven.lifecycle.internal.LifecycleModuleBuilder.buildProject(LifecycleModuleBuilder.java:59)
        at org.apache.maven.lifecycle.internal.LifecycleStarter.singleThreadedBuild(LifecycleStarter.java:183)
        at org.apache.maven.lifecycle.internal.LifecycleStarter.execute(LifecycleStarter.java:161)
        at org.apache.maven.DefaultMaven.doExecute(DefaultMaven.java:320)
        at org.apache.maven.DefaultMaven.execute(DefaultMaven.java:156)
        at org.apache.maven.cli.MavenCli.execute(MavenCli.java:537)
        at org.apache.maven.cli.MavenCli.doMain(MavenCli.java:196)
        at org.apache.maven.cli.MavenCli.main(MavenCli.java:141)
        at sun.reflect.NativeMethodAccessorImpl.invoke0(Native Method)
        at sun.reflect.NativeMethodAccessorImpl.invoke(NativeMethodAccessorImpl.java:39)
        at sun.reflect.DelegatingMethodAccessorImpl.invoke(DelegatingMethodAccessorImpl.java:25)
        at java.lang.reflect.Method.invoke(Method.java:597)
        at org.codehaus.plexus.classworlds.launcher.Launcher.launchEnhanced(Launcher.java:290)
        at org.codehaus.plexus.classworlds.launcher.Launcher.launch(Launcher.java:230)
        at org.codehaus.plexus.classworlds.launcher.Launcher.mainWithExitCode(Launcher.java:409)
        at org.codehaus.plexus.classworlds.launcher.Launcher.main(Launcher.java:352)
Caused by: org.apache.maven.project.DependencyResolutionException: Could not resolve dependencies
for project org.apache.directo
ry.server:apacheds-interceptors-admin:bundle:2.0.0-M7-SNAPSHOT: Failure to find org.apache.directory.server:apacheds-core-api:ja
r:tests:2.0.0-M7-SNAPSHOT in https://repository.apache.org/content/repositories/snapshots/
was cached in the local repository, r
esolution will not be reattempted until the update interval of apache.snapshots has elapsed
or updates are forced
        at org.apache.maven.project.DefaultProjectDependenciesResolver.resolve(DefaultProjectDependenciesResolver.java:189)
        at org.apache.maven.lifecycle.internal.LifecycleDependencyResolver.getDependencies(LifecycleDependencyResolver.java:185)

        ... 22 more
Caused by: org.sonatype.aether.resolution.DependencyResolutionException: Failure to find org.apache.directory.server:apacheds-co
re-api:jar:tests:2.0.0-M7-SNAPSHOT in https://repository.apache.org/content/repositories/snapshots/
was cached in the local repo
sitory, resolution will not be reattempted until the update interval of apache.snapshots has
elapsed or updates are forced
        at org.sonatype.aether.impl.internal.DefaultRepositorySystem.resolveDependencies(DefaultRepositorySystem.java:375)
        at org.apache.maven.project.DefaultProjectDependenciesResolver.resolve(DefaultProjectDependenciesResolver.java:183)
        ... 23 more
Caused by: org.sonatype.aether.resolution.ArtifactResolutionException: Failure to find org.apache.directory.server:apacheds-core
-api:jar:tests:2.0.0-M7-SNAPSHOT in https://repository.apache.org/content/repositories/snapshots/
was cached in the local reposi
tory, resolution will not be reattempted until the update interval of apache.snapshots has
elapsed or updates are forced
        at org.sonatype.aether.impl.internal.DefaultArtifactResolver.resolve(DefaultArtifactResolver.java:538)
        at org.sonatype.aether.impl.internal.DefaultArtifactResolver.resolveArtifacts(DefaultArtifactResolver.java:216)
        at org.sonatype.aether.impl.internal.DefaultRepositorySystem.resolveDependencies(DefaultRepositorySystem.java:358)
        ... 24 more
Caused by: org.sonatype.aether.transfer.ArtifactNotFoundException: Failure to find org.apache.directory.server:apacheds-core-api
:jar:tests:2.0.0-M7-SNAPSHOT in https://repository.apache.org/content/repositories/snapshots/
was cached in the local repository
, resolution will not be reattempted until the update interval of apache.snapshots has elapsed
or updates are forced
        at org.sonatype.aether.impl.internal.DefaultUpdateCheckManager.newException(DefaultUpdateCheckManager.java:230)
        at org.sonatype.aether.impl.internal.DefaultUpdateCheckManager.checkArtifact(DefaultUpdateCheckManager.java:204)
        at org.sonatype.aether.impl.internal.DefaultArtifactResolver.resolve(DefaultArtifactResolver.java:427)
        ... 26 more
[ERROR]
[ERROR] Re-run Maven using the -X switch to enable full debug logging.
[ERROR]
[ERROR] For more information about the errors and possible solutions, please read the following
articles:
[ERROR] [Help 1] http://cwiki.apache.org/confluence/display/MAVEN/DependencyResolutionException
[ERROR]
[ERROR] After correcting the problems, you can resume the build with the command
[ERROR]   mvn <goals> -rf :apacheds-interceptors-admin

Regards,
Carlo Accorsi




Mime
  • Unnamed multipart/alternative (inline, None, 0 bytes)
View raw message