directory-users mailing list archives

Site index · List index
Message view « Date » · « Thread »
Top « Date » · « Thread »
From "Wang, Xunhua - wangxx" <wan...@jmu.edu>
Subject RE: [ERROR] Failed to execute goal on project apacheds-all: Could not resolve dependencies for project org.apache.directory.server:apacheds-all:jar:2.0.0-M7-SNAPSHOT: Could not find artifact
Date Thu, 01 Mar 2012 23:50:34 GMT
Just tried and went much farther than before:

+++++ ERROR BEGINS +++++
[INFO] ------------------------------------------------------------------------
[INFO] Reactor Summary:
[INFO]
[INFO] ApacheDS All ...................................... SUCCESS [24.507s]
[INFO] ApacheDS Logger Interceptor ....................... SUCCESS [5.476s]
[INFO] ApacheDS Password Hashing Interceptor ............. SUCCESS [3.603s]
[INFO] ApacheDS Core Integration ......................... SUCCESS [16:44.523s]
[INFO] ApacheDS Server Integration ....................... SUCCESS [7:26.849s]
[INFO] ApacheDS DirectoryService-WebApp bridge ........... SUCCESS [6.447s]
[INFO] ApacheDS Jetty HTTP Server Integration ............ SUCCESS [12.112s]
[INFO] ApacheDS Service Builder .......................... SUCCESS [6.531s]
[INFO] ApacheDS Protocol Kerberos Test ................... FAILURE [5:13.429s]
[INFO] Apache Directory LDAP Client API test ............. SKIPPED
[INFO] ApacheDS Service .................................. SKIPPED
[INFO] ApacheDS Wrapper .................................. SKIPPED
[INFO] ApacheDS Installers Maven Plugin .................. SKIPPED
[INFO] ApacheDS Installers ............................... SKIPPED
[INFO] ApacheDS Manuals .................................. SKIPPED
[INFO] ApacheDS Build With Dependencies .................. SKIPPED
[INFO] ------------------------------------------------------------------------
[INFO] BUILD FAILURE
[INFO] ------------------------------------------------------------------------
[INFO] Total time: 30:29.313s
[INFO] Finished at: Thu Mar 01 18:06:41 EST 2012
[INFO] Final Memory: 62M/148M
[INFO] ------------------------------------------------------------------------
[ERROR] Failed to execute goal org.apache.maven.plugins:maven-surefire-plugin:2.12:test (default-test)
on project apacheds-kerberos-test: There are test fa
ilures.
[ERROR]
[ERROR] Please refer to C:\tmp\apacheds\apacheds-trunk\apacheds\kerberos-test\target\surefire-reports
for the individual test results.
[ERROR] -> [Help 1]
[ERROR]
[ERROR] To see the full stack trace of the errors, re-run Maven with the -e switch.
[ERROR] Re-run Maven using the -X switch to enable full debug logging.
[ERROR]
[ERROR] For more information about the errors and possible solutions, please read the following
articles:
[ERROR] [Help 1] http://cwiki.apache.org/confluence/display/MAVEN/MojoFailureException
[ERROR]
[ERROR] After correcting the problems, you can resume the build with the command
[ERROR]   mvn <goals> -rf :apacheds-kerberos-test
+++++ ERROR ENDS +++++

Again which KDC server does apacheds-kerberos-test test? How can I pass the apacheds-kerberos-test
to finish the whole process?

Thank you.

Steve
________________________________________
From: Emmanuel Lécharny [elecharny@gmail.com]
Sent: Thursday, March 01, 2012 6:36 PM
To: users@directory.apache.org
Subject: Re: [ERROR] Failed to execute goal on project apacheds-all: Could not resolve dependencies
for project org.apache.directory.server:apacheds-all:jar:2.0.0-M7-SNAPSHOT: Could not find
artifact

Le 3/1/12 8:24 PM, Wang, Xunhua - wangxx a écrit :
> Thank you.
>
> In my case, upgrading JDK to 1.6.0_30 does _not_ help. Still got the following error:

Can you give it a try with the latest trunk ? We have fixed some
pom.xml, it might be better.


--
Regards,
Cordialement,
Emmanuel Lécharny
www.iktek.com


Mime
View raw message