directory-notifications mailing list archives

Site index · List index
Message view « Date » · « Thread »
Top « Date » · « Thread »
From Apache Jenkins Server <jenk...@builds.apache.org>
Subject Build failed in Jenkins: Directory » dir-fortress-core-docker-apacheds-test #73
Date Sat, 01 May 2021 23:34:28 GMT
See <https://ci-builds.apache.org/job/Directory/job/dir-fortress-core-docker-apacheds-test/73/display/redirect>

Changes:


------------------------------------------
[...truncated 103.61 KB...]
2021-05-01 23:30:016 INFO  UserDAO:1792 - deleteResetFlag user [jtsTU5User6] no such attribute:pwdReset
2021-05-01 23:30:017 INFO  UserDAO:1792 - deleteResetFlag user [jtsTU5User6] no such attribute:pwdReset
2021-05-01 23:30:018 INFO  UserDAO:1792 - deleteResetFlag user [jtsTU5User6] no such attribute:pwdReset
2021-05-01 23:30:019 INFO  UserDAO:1792 - deleteResetFlag user [jtsTU5User6] no such attribute:pwdReset
2021-05-01 23:30:020 INFO  UserDAO:1792 - deleteResetFlag user [jtsTU5User6] no such attribute:pwdReset
2021-05-01 23:30:021 INFO  UserDAO:1792 - deleteResetFlag user [jtsTU5User6] no such attribute:pwdReset
2021-05-01 23:30:022 INFO  UserDAO:1792 - deleteResetFlag user [jtsTU5User6] no such attribute:pwdReset
2021-05-01 23:30:023 INFO  UserDAO:1792 - deleteResetFlag user [jtsTU5User6] no such attribute:pwdReset
2021-05-01 23:30:025 INFO  UserDAO:1792 - deleteResetFlag user [jtsTU5User6] no such attribute:pwdReset
2021-05-01 23:30:025 INFO  UserDAO:1792 - deleteResetFlag user [jtsTU5User6] no such attribute:pwdReset
2021-05-01 23:30:026 INFO  UserDAO:1792 - deleteResetFlag user [jtsTU5User6] no such attribute:pwdReset
2021-05-01 23:30:028 INFO  UserDAO:1792 - deleteResetFlag user [jtsTU5User6] no such attribute:pwdReset
2021-05-01 23:30:029 INFO  UserDAO:1792 - deleteResetFlag user [jtsTU5User6] no such attribute:pwdReset
2021-05-01 23:30:030 INFO  UserDAO:1792 - deleteResetFlag user [jtsTU5User6] no such attribute:pwdReset
2021-05-01 23:30:031 INFO  UserDAO:1792 - deleteResetFlag user [jtsTU5User6] no such attribute:pwdReset
2021-05-01 23:30:032 INFO  UserDAO:1792 - deleteResetFlag user [jtsTU5User6] no such attribute:pwdReset
2021-05-01 23:30:033 INFO  UserDAO:1792 - deleteResetFlag user [jtsTU5User6] no such attribute:pwdReset
2021-05-01 23:30:034 INFO  UserDAO:1792 - deleteResetFlag user [jtsTU5User6] no such attribute:pwdReset
2021-05-01 23:30:035 INFO  UserDAO:1792 - deleteResetFlag user [jtsTU5User6] no such attribute:pwdReset
2021-05-01 23:30:036 INFO  UserDAO:1792 - deleteResetFlag user [jtsTU5User6] no such attribute:pwdReset
2021-05-01 23:30:037 INFO  UserDAO:1792 - deleteResetFlag user [jtsTU5User6] no such attribute:pwdReset
2021-05-01 23:30:038 INFO  UserDAO:1792 - deleteResetFlag user [jtsTU5User6] no such attribute:pwdReset
2021-05-01 23:30:039 INFO  UserDAO:1792 - deleteResetFlag user [jtsTU5User6] no such attribute:pwdReset
2021-05-01 23:30:040 INFO  UserDAO:1792 - deleteResetFlag user [jtsTU5User6] no such attribute:pwdReset
2021-05-01 23:30:041 INFO  UserDAO:1792 - deleteResetFlag user [jtsTU5User6] no such attribute:pwdReset
2021-05-01 23:30:043 INFO  UserDAO:1792 - deleteResetFlag user [jtsTU5User6] no such attribute:pwdReset
2021-05-01 23:30:044 INFO  UserDAO:1792 - deleteResetFlag user [jtsTU5User6] no such attribute:pwdReset
2021-05-01 23:30:045 INFO  UserDAO:1792 - deleteResetFlag user [jtsTU5User6] no such attribute:pwdReset
2021-05-01 23:30:046 INFO  UserDAO:1792 - deleteResetFlag user [jtsTU5User6] no such attribute:pwdReset
2021-05-01 23:30:047 INFO  UserDAO:1792 - deleteResetFlag user [jtsTU5User6] no such attribute:pwdReset
2021-05-01 23:30:048 INFO  UserDAO:1792 - deleteResetFlag user [jtsTU5User6] no such attribute:pwdReset
2021-05-01 23:30:049 INFO  UserDAO:1792 - deleteResetFlag user [jtsTU5User6] no such attribute:pwdReset
2021-05-01 23:30:050 INFO  UserDAO:1792 - deleteResetFlag user [jtsTU5User6] no such attribute:pwdReset
2021-05-01 23:30:051 INFO  UserDAO:1792 - deleteResetFlag user [jtsTU5User6] no such attribute:pwdReset
2021-05-01 23:30:052 INFO  UserDAO:1792 - deleteResetFlag user [jtsTU5User6] no such attribute:pwdReset
2021-05-01 23:30:053 INFO  UserDAO:1792 - deleteResetFlag user [jtsTU5User6] no such attribute:pwdReset
2021-05-01 23:30:054 INFO  UserDAO:1792 - deleteResetFlag user [jtsTU5User6] no such attribute:pwdReset
2021-05-01 23:30:055 INFO  UserDAO:1792 - deleteResetFlag user [jtsTU5User6] no such attribute:pwdReset
2021-05-01 23:30:056 INFO  UserDAO:1792 - deleteResetFlag user [jtsTU5User6] no such attribute:pwdReset
2021-05-01 23:30:057 INFO  UserDAO:1792 - deleteResetFlag user [jtsTU5User6] no such attribute:pwdReset
2021-05-01 23:30:058 INFO  UserDAO:1792 - deleteResetFlag user [jtsTU5User6] no such attribute:pwdReset
2021-05-01 23:31:000 INFO  UserDAO:1792 - deleteResetFlag user [jtsTU5User6] no such attribute:pwdReset
2021-05-01 23:31:000 INFO  UserDAO:1792 - deleteResetFlag user [jtsTU5User6] no such attribute:pwdReset
2021-05-01 23:31:002 INFO  UserDAO:1792 - deleteResetFlag user [jtsTU5User6] no such attribute:pwdReset
2021-05-01 23:31:003 INFO  UserDAO:1792 - deleteResetFlag user [jtsTU5User6] no such attribute:pwdReset
2021-05-01 23:31:004 INFO  UserDAO:1792 - deleteResetFlag user [jtsTU5User6] no such attribute:pwdReset
2021-05-01 23:31:005 INFO  UserDAO:1792 - deleteResetFlag user [jtsTU5User6] no such attribute:pwdReset
2021-05-01 23:31:006 INFO  UserDAO:1792 - deleteResetFlag user [jtsTU5User6] no such attribute:pwdReset
2021-05-01 23:31:007 INFO  UserDAO:1792 - deleteResetFlag user [jtsTU5User6] no such attribute:pwdReset
2021-05-01 23:31:008 INFO  UserDAO:1792 - deleteResetFlag user [jtsTU5User6] no such attribute:pwdReset
2021-05-01 23:31:009 INFO  UserDAO:1792 - deleteResetFlag user [jtsTU5User6] no such attribute:pwdReset
2021-05-01 23:31:010 INFO  UserDAO:1792 - deleteResetFlag user [jtsTU5User6] no such attribute:pwdReset
2021-05-01 23:31:011 INFO  UserDAO:1792 - deleteResetFlag user [jtsTU5User6] no such attribute:pwdReset
2021-05-01 23:31:012 INFO  UserDAO:1792 - deleteResetFlag user [jtsTU5User6] no such attribute:pwdReset
2021-05-01 23:31:013 INFO  UserDAO:1792 - deleteResetFlag user [jtsTU5User6] no such attribute:pwdReset
2021-05-01 23:31:014 INFO  UserDAO:1792 - deleteResetFlag user [jtsTU5User6] no such attribute:pwdReset
2021-05-01 23:31:016 INFO  UserDAO:1792 - deleteResetFlag user [jtsTU5User6] no such attribute:pwdReset
2021-05-01 23:31:017 INFO  UserDAO:1792 - deleteResetFlag user [jtsTU5User6] no such attribute:pwdReset
2021-05-01 23:31:018 INFO  UserDAO:1792 - deleteResetFlag user [jtsTU5User6] no such attribute:pwdReset
2021-05-01 23:31:019 INFO  UserDAO:1792 - deleteResetFlag user [jtsTU5User6] no such attribute:pwdReset
2021-05-01 23:31:020 INFO  UserDAO:1792 - deleteResetFlag user [jtsTU5User6] no such attribute:pwdReset
2021-05-01 23:31:021 INFO  UserDAO:1792 - deleteResetFlag user [jtsTU5User6] no such attribute:pwdReset
2021-05-01 23:31:022 INFO  UserDAO:1792 - deleteResetFlag user [jtsTU5User6] no such attribute:pwdReset
2021-05-01 23:31:023 INFO  UserDAO:1792 - deleteResetFlag user [jtsTU5User6] no such attribute:pwdReset
2021-05-01 23:31:024 INFO  UserDAO:1792 - deleteResetFlag user [jtsTU5User6] no such attribute:pwdReset
2021-05-01 23:31:025 INFO  UserDAO:1792 - deleteResetFlag user [jtsTU5User6] no such attribute:pwdReset
2021-05-01 23:31:026 INFO  UserDAO:1792 - deleteResetFlag user [jtsTU5User6] no such attribute:pwdReset
2021-05-01 23:31:027 INFO  UserDAO:1792 - deleteResetFlag user [jtsTU5User6] no such attribute:pwdReset
2021-05-01 23:31:028 INFO  UserDAO:1792 - deleteResetFlag user [jtsTU5User6] no such attribute:pwdReset
2021-05-01 23:31:030 INFO  UserDAO:1792 - deleteResetFlag user [jtsTU5User6] no such attribute:pwdReset
2021-05-01 23:31:031 INFO  UserDAO:1792 - deleteResetFlag user [jtsTU5User6] no such attribute:pwdReset
2021-05-01 23:31:032 INFO  UserDAO:1792 - deleteResetFlag user [jtsTU5User6] no such attribute:pwdReset
2021-05-01 23:31:033 INFO  UserDAO:1792 - deleteResetFlag user [jtsTU5User6] no such attribute:pwdReset
2021-05-01 23:31:034 INFO  UserDAO:1792 - deleteResetFlag user [jtsTU5User6] no such attribute:pwdReset
2021-05-01 23:31:035 INFO  UserDAO:1792 - deleteResetFlag user [jtsTU5User6] no such attribute:pwdReset
2021-05-01 23:31:036 INFO  UserDAO:1792 - deleteResetFlag user [jtsTU5User6] no such attribute:pwdReset
2021-05-01 23:31:037 INFO  UserDAO:1792 - deleteResetFlag user [jtsTU5User6] no such attribute:pwdReset
2021-05-01 23:31:037 INFO  LogUtil:64 - PWLEN7 PLCY TP1 USR TU5
2021-05-01 23:31:037 INFO  LogUtil:64 - PWLEN8 PLCY TP1 USR TU5
2021-05-01 23:31:038 INFO  LogUtil:64 - PWEXP7 PLCY TP1 USR TU5
2021-05-01 23:31:040 INFO  UserDAO:1792 - deleteResetFlag user [jtsTU5User9] no such attribute:pwdReset
2021-05-01 23:31:040 INFO  LogUtil:64 - org.apache.directory.fortress.core.impl.TestUtils.sleep
for len=2000
2021-05-01 23:31:042 INFO  LogUtil:64 - org.apache.directory.fortress.core.impl.TestUtils.sleep
for len=1000
2021-05-01 23:31:043 ERROR PswdPolicyMgrImplTest:532 - expireWarning caught SecurityException
rc=1017, msg=checkPwPolicies for userId [jtsTU5User9] PASSWORD HAS EXPIRED
org.apache.directory.fortress.core.PasswordException: checkPwPolicies for userId [jtsTU5User9]
PASSWORD HAS EXPIRED
	at org.apache.directory.fortress.core.impl.UserDAO.checkPassword(UserDAO.java:847) ~[classes/:?]
	at org.apache.directory.fortress.core.impl.UserP.authenticate(UserP.java:419) ~[classes/:?]
	at org.apache.directory.fortress.core.impl.UserP.createSession(UserP.java:578) ~[classes/:?]
	at org.apache.directory.fortress.core.impl.UserP.createSession(UserP.java:497) ~[classes/:?]
	at org.apache.directory.fortress.core.impl.AccessMgrImpl.createSession(AccessMgrImpl.java:115)
~[classes/:?]
	at org.apache.directory.fortress.core.impl.PswdPolicyMgrImplTest.expireWarning(PswdPolicyMgrImplTest.java:513)
[test-classes/:?]
	at org.apache.directory.fortress.core.impl.PswdPolicyMgrImplTest.testExpireWarning(PswdPolicyMgrImplTest.java:460)
[test-classes/:?]
	at sun.reflect.NativeMethodAccessorImpl.invoke0(Native Method) ~[?:1.8.0_241]
	at sun.reflect.NativeMethodAccessorImpl.invoke(NativeMethodAccessorImpl.java:62) ~[?:1.8.0_241]
	at sun.reflect.DelegatingMethodAccessorImpl.invoke(DelegatingMethodAccessorImpl.java:43)
~[?:1.8.0_241]
	at java.lang.reflect.Method.invoke(Method.java:498) ~[?:1.8.0_241]
	at junit.framework.TestCase.runTest(TestCase.java:176) [junit-4.12.jar:4.12]
	at junit.framework.TestCase.runBare(TestCase.java:141) [junit-4.12.jar:4.12]
	at junit.framework.TestResult$1.protect(TestResult.java:122) [junit-4.12.jar:4.12]
	at junit.framework.TestResult.runProtected(TestResult.java:142) [junit-4.12.jar:4.12]
	at junit.framework.TestResult.run(TestResult.java:125) [junit-4.12.jar:4.12]
	at junit.framework.TestCase.run(TestCase.java:129) [junit-4.12.jar:4.12]
	at junit.framework.TestSuite.runTest(TestSuite.java:252) [junit-4.12.jar:4.12]
	at junit.framework.TestSuite.run(TestSuite.java:247) [junit-4.12.jar:4.12]
	at org.junit.internal.runners.JUnit38ClassRunner.run(JUnit38ClassRunner.java:86) [junit-4.12.jar:4.12]
	at org.apache.maven.surefire.junit4.JUnit4Provider.execute(JUnit4Provider.java:283) [surefire-junit4-2.18.1.jar:2.18.1]
	at org.apache.maven.surefire.junit4.JUnit4Provider.executeWithRerun(JUnit4Provider.java:173)
[surefire-junit4-2.18.1.jar:2.18.1]
	at org.apache.maven.surefire.junit4.JUnit4Provider.executeTestSet(JUnit4Provider.java:153)
[surefire-junit4-2.18.1.jar:2.18.1]
	at org.apache.maven.surefire.junit4.JUnit4Provider.invoke(JUnit4Provider.java:128) [surefire-junit4-2.18.1.jar:2.18.1]
	at org.apache.maven.surefire.booter.ForkedBooter.invokeProviderInSameClassLoader(ForkedBooter.java:203)
[surefire-booter-2.18.1.jar:2.18.1]
	at org.apache.maven.surefire.booter.ForkedBooter.runSuitesInProcess(ForkedBooter.java:155)
[surefire-booter-2.18.1.jar:2.18.1]
	at org.apache.maven.surefire.booter.ForkedBooter.main(ForkedBooter.java:103) [surefire-booter-2.18.1.jar:2.18.1]
2021-05-01 23:31:043 INFO  LogUtil:64 - PWGRACE9 PLCY TP1 USR TU5
2021-05-01 23:31:045 INFO  UserDAO:1792 - deleteResetFlag user [jtsTU5User11] no such attribute:pwdReset
2021-05-01 23:31:045 INFO  LogUtil:64 - org.apache.directory.fortress.core.impl.TestUtils.sleep
for len=6000
2021-05-01 23:31:051 INFO  LogUtil:64 - org.apache.directory.fortress.core.impl.TestUtils.sleep
for len=1000
2021-05-01 23:31:052 INFO  LogUtil:64 - org.apache.directory.fortress.core.impl.TestUtils.sleep
for len=1000
2021-05-01 23:31:054 INFO  LogUtil:64 - org.apache.directory.fortress.core.impl.TestUtils.sleep
for len=1000
2021-05-01 23:31:055 INFO  LogUtil:64 - org.apache.directory.fortress.core.impl.TestUtils.sleep
for len=1000
2021-05-01 23:31:057 INFO  LogUtil:64 - org.apache.directory.fortress.core.impl.TestUtils.sleep
for len=1000
2021-05-01 23:31:058 INFO  LogUtil:64 - org.apache.directory.fortress.core.impl.TestUtils.sleep
for len=1000
2021-05-01 23:32:000 INFO  LogUtil:64 - org.apache.directory.fortress.core.impl.TestUtils.sleep
for len=1000
2021-05-01 23:32:001 INFO  LogUtil:64 - org.apache.directory.fortress.core.impl.TestUtils.sleep
for len=1000
2021-05-01 23:32:003 INFO  LogUtil:64 - org.apache.directory.fortress.core.impl.TestUtils.sleep
for len=1000
2021-05-01 23:32:004 INFO  LogUtil:64 - org.apache.directory.fortress.core.impl.TestUtils.sleep
for len=1000
2021-05-01 23:32:006 INFO  LogUtil:64 - org.apache.directory.fortress.core.impl.TestUtils.sleep
for len=1000
2021-05-01 23:32:007 INFO  LogUtil:64 - PWGRACE10 PLCY TP1 USR TU5
2021-05-01 23:32:009 INFO  UserDAO:1792 - deleteResetFlag user [jtsTU5User12] no such attribute:pwdReset
2021-05-01 23:32:009 INFO  LogUtil:64 - org.apache.directory.fortress.core.impl.TestUtils.sleep
for len=5000
2021-05-01 23:32:014 INFO  LogUtil:64 - org.apache.directory.fortress.core.impl.TestUtils.sleep
for len=1000
2021-05-01 23:32:015 INFO  LogUtil:64 - org.apache.directory.fortress.core.impl.TestUtils.sleep
for len=1000
2021-05-01 23:32:017 INFO  LogUtil:64 - org.apache.directory.fortress.core.impl.TestUtils.sleep
for len=1000
2021-05-01 23:32:018 INFO  LogUtil:64 - org.apache.directory.fortress.core.impl.TestUtils.sleep
for len=1000
2021-05-01 23:32:019 INFO  LogUtil:64 - org.apache.directory.fortress.core.impl.TestUtils.sleep
for len=1000
2021-05-01 23:32:021 INFO  LogUtil:64 - org.apache.directory.fortress.core.impl.TestUtils.sleep
for len=1000
2021-05-01 23:32:022 INFO  LogUtil:64 - PWMAXFAILK11 PLCY TP1 USR TU5
2021-05-01 23:32:023 INFO  LogUtil:64 - org.apache.directory.fortress.core.impl.TestUtils.sleep
for len=1000
2021-05-01 23:32:024 INFO  LogUtil:64 - org.apache.directory.fortress.core.impl.TestUtils.sleep
for len=1000
2021-05-01 23:32:026 INFO  LogUtil:64 - org.apache.directory.fortress.core.impl.TestUtils.sleep
for len=1000
2021-05-01 23:32:027 INFO  LogUtil:64 - org.apache.directory.fortress.core.impl.TestUtils.sleep
for len=1000
2021-05-01 23:32:029 INFO  LogUtil:64 - org.apache.directory.fortress.core.impl.TestUtils.sleep
for len=1000
2021-05-01 23:32:030 INFO  LogUtil:64 - org.apache.directory.fortress.core.impl.TestUtils.sleep
for len=1000
2021-05-01 23:32:032 INFO  LogUtil:64 - org.apache.directory.fortress.core.impl.TestUtils.sleep
for len=1000
2021-05-01 23:32:033 INFO  LogUtil:64 - org.apache.directory.fortress.core.impl.TestUtils.sleep
for len=1000
2021-05-01 23:32:034 INFO  LogUtil:64 - org.apache.directory.fortress.core.impl.TestUtils.sleep
for len=1000
2021-05-01 23:32:036 INFO  LogUtil:64 - org.apache.directory.fortress.core.impl.TestUtils.sleep
for len=1000
2021-05-01 23:32:038 INFO  LogUtil:64 - PWMAXFAIL12 PLCY TP1 USR TU5
2021-05-01 23:32:039 INFO  LogUtil:64 - org.apache.directory.fortress.core.impl.TestUtils.sleep
for len=1000
2021-05-01 23:32:041 INFO  LogUtil:64 - org.apache.directory.fortress.core.impl.TestUtils.sleep
for len=1000
2021-05-01 23:32:042 INFO  LogUtil:64 - org.apache.directory.fortress.core.impl.TestUtils.sleep
for len=1000
2021-05-01 23:32:043 INFO  LogUtil:64 - org.apache.directory.fortress.core.impl.TestUtils.sleep
for len=1000
2021-05-01 23:32:045 INFO  LogUtil:64 - org.apache.directory.fortress.core.impl.TestUtils.sleep
for len=1000
2021-05-01 23:32:047 INFO  LogUtil:64 - PWDURATION13 PLCY TP1 USR TU5
2021-05-01 23:32:048 INFO  LogUtil:64 - org.apache.directory.fortress.core.impl.TestUtils.sleep
for len=1000
2021-05-01 23:32:049 INFO  LogUtil:64 - org.apache.directory.fortress.core.impl.TestUtils.sleep
for len=1000
2021-05-01 23:32:051 INFO  LogUtil:64 - org.apache.directory.fortress.core.impl.TestUtils.sleep
for len=1000
2021-05-01 23:32:052 INFO  LogUtil:64 - org.apache.directory.fortress.core.impl.TestUtils.sleep
for len=4000
2021-05-01 23:32:056 INFO  LogUtil:64 - org.apache.directory.fortress.core.impl.TestUtils.sleep
for len=1000
2021-05-01 23:32:057 INFO  LogUtil:64 - PWDURATION14 PLCY TP1 USR TU5
2021-05-01 23:32:059 INFO  LogUtil:64 - org.apache.directory.fortress.core.impl.TestUtils.sleep
for len=1000
2021-05-01 23:33:000 INFO  LogUtil:64 - org.apache.directory.fortress.core.impl.TestUtils.sleep
for len=1000
2021-05-01 23:33:001 INFO  LogUtil:64 - org.apache.directory.fortress.core.impl.TestUtils.sleep
for len=1000
2021-05-01 23:33:003 INFO  LogUtil:64 - org.apache.directory.fortress.core.impl.TestUtils.sleep
for len=1000
2021-05-01 23:33:004 INFO  LogUtil:64 - org.apache.directory.fortress.core.impl.TestUtils.sleep
for len=1000
2021-05-01 23:33:005 INFO  LogUtil:64 - org.apache.directory.fortress.core.impl.TestUtils.sleep
for len=5000
2021-05-01 23:33:010 INFO  LogUtil:64 - org.apache.directory.fortress.core.impl.TestUtils.sleep
for len=1000
2021-05-01 23:33:012 INFO  LogUtil:64 - PWLOCK15 PLCY TP1 USR TU5
2021-05-01 23:33:013 INFO  LogUtil:64 - org.apache.directory.fortress.core.impl.TestUtils.sleep
for len=1000
2021-05-01 23:33:015 INFO  LogUtil:64 - org.apache.directory.fortress.core.impl.TestUtils.sleep
for len=1000
2021-05-01 23:33:017 INFO  LogUtil:64 - org.apache.directory.fortress.core.impl.TestUtils.sleep
for len=1000
2021-05-01 23:33:018 INFO  LogUtil:64 - PWLOCK16 PLCY TP1 USR TU5
2021-05-01 23:33:019 INFO  LogUtil:64 - org.apache.directory.fortress.core.impl.TestUtils.sleep
for len=1000
2021-05-01 23:33:021 INFO  LogUtil:64 - org.apache.directory.fortress.core.impl.TestUtils.sleep
for len=1000
2021-05-01 23:33:024 INFO  LogUtil:64 - org.apache.directory.fortress.core.impl.TestUtils.sleep
for len=1000
2021-05-01 23:33:025 INFO  LogUtil:64 - PWINTERVAL17 PLCY TP1 USR TU5
2021-05-01 23:33:026 INFO  LogUtil:64 - org.apache.directory.fortress.core.impl.TestUtils.sleep
for len=1000
2021-05-01 23:33:027 INFO  LogUtil:64 - org.apache.directory.fortress.core.impl.TestUtils.sleep
for len=1000
2021-05-01 23:33:029 INFO  LogUtil:64 - org.apache.directory.fortress.core.impl.TestUtils.sleep
for len=1000
2021-05-01 23:33:030 INFO  LogUtil:64 - org.apache.directory.fortress.core.impl.TestUtils.sleep
for len=1000
2021-05-01 23:33:032 INFO  LogUtil:64 - org.apache.directory.fortress.core.impl.TestUtils.sleep
for len=1000
2021-05-01 23:33:033 INFO  LogUtil:64 - org.apache.directory.fortress.core.impl.TestUtils.sleep
for len=5000
2021-05-01 23:33:038 INFO  LogUtil:64 - org.apache.directory.fortress.core.impl.TestUtils.sleep
for len=1000
2021-05-01 23:33:039 INFO  LogUtil:64 - org.apache.directory.fortress.core.impl.TestUtils.sleep
for len=1000
2021-05-01 23:33:040 INFO  LogUtil:64 - org.apache.directory.fortress.core.impl.TestUtils.sleep
for len=1000
2021-05-01 23:33:042 INFO  LogUtil:64 - org.apache.directory.fortress.core.impl.TestUtils.sleep
for len=1000
2021-05-01 23:33:043 INFO  LogUtil:64 - org.apache.directory.fortress.core.impl.TestUtils.sleep
for len=1000
2021-05-01 23:33:045 INFO  LogUtil:64 - org.apache.directory.fortress.core.impl.TestUtils.sleep
for len=1000
2021-05-01 23:33:046 INFO  LogUtil:64 - org.apache.directory.fortress.core.impl.TestUtils.sleep
for len=5000
2021-05-01 23:33:051 INFO  LogUtil:64 - org.apache.directory.fortress.core.impl.TestUtils.sleep
for len=1000
2021-05-01 23:33:052 INFO  LogUtil:64 - PWINTERVAL18 PLCY TP1 USR TU5
2021-05-01 23:33:053 INFO  LogUtil:64 - org.apache.directory.fortress.core.impl.TestUtils.sleep
for len=1000
2021-05-01 23:33:054 INFO  LogUtil:64 - org.apache.directory.fortress.core.impl.TestUtils.sleep
for len=1000
2021-05-01 23:33:055 INFO  LogUtil:64 - org.apache.directory.fortress.core.impl.TestUtils.sleep
for len=7000
2021-05-01 23:34:002 INFO  LogUtil:64 - org.apache.directory.fortress.core.impl.TestUtils.sleep
for len=1000
2021-05-01 23:34:004 INFO  LogUtil:64 - org.apache.directory.fortress.core.impl.TestUtils.sleep
for len=1000
2021-05-01 23:34:005 INFO  LogUtil:64 - org.apache.directory.fortress.core.impl.TestUtils.sleep
for len=1000
2021-05-01 23:34:006 INFO  LogUtil:64 - org.apache.directory.fortress.core.impl.TestUtils.sleep
for len=7000
2021-05-01 23:34:013 INFO  LogUtil:64 - org.apache.directory.fortress.core.impl.TestUtils.sleep
for len=1000
2021-05-01 23:34:014 INFO  LogUtil:64 - PWMUST19 PLCY TP1 USR TU5
2021-05-01 23:34:016 INFO  LogUtil:64 - org.apache.directory.fortress.core.impl.TestUtils.sleep
for len=1000
2021-05-01 23:34:017 INFO  LogUtil:64 - PWMUST20 PLCY TP1 USR TU5
2021-05-01 23:34:019 INFO  LogUtil:64 - org.apache.directory.fortress.core.impl.TestUtils.sleep
for len=1000
2021-05-01 23:34:020 INFO  LogUtil:64 - PWALLOW21 PLCY TP1 USR TU5
2021-05-01 23:34:020 INFO  LogUtil:64 - org.apache.directory.fortress.core.impl.TestUtils.sleep
for len=1000
2021-05-01 23:34:021 INFO  LogUtil:64 - PWALLOW22 PLCY TP1 USR TU5
2021-05-01 23:34:023 INFO  UserDAO:1792 - deleteResetFlag user [jtsTU5User24] no such attribute:pwdReset
2021-05-01 23:34:023 INFO  LogUtil:64 - PWSAFEW23 PLCY TP1 USR TU5
2021-05-01 23:34:023 INFO  LogUtil:64 - org.apache.directory.fortress.core.impl.TestUtils.sleep
for len=1000
2021-05-01 23:34:024 INFO  LogUtil:64 - PWSAFE24 PLCY TP1 USR TU5
2021-05-01 23:34:026 INFO  UserDAO:1792 - deleteResetFlag user [jtsTU5User26] no such attribute:pwdReset
NUMBER OF ADDS: 1146
NUMBER OF BINDS: 1125
NUMBER OF DELETES: 0
NUMBER OF MODS: 4244
NUMBER OF READS: 20168
NUMBER OF SEARCHES: 7080
Tests run: 128, Failures: 1, Errors: 0, Skipped: 0, Time elapsed: 3,395.18 sec <<<
FAILURE! - in org.apache.directory.fortress.core.impl.FortressJUnitTest
testExpireWarning(org.apache.directory.fortress.core.impl.PswdPolicyMgrImplTest)  Time elapsed:
5.242 sec  <<< FAILURE!
junit.framework.AssertionFailedError: checkPwPolicies for userId [jtsTU5User9] PASSWORD HAS
EXPIRED
	at junit.framework.Assert.fail(Assert.java:57)
	at junit.framework.TestCase.fail(TestCase.java:227)
	at org.apache.directory.fortress.core.impl.PswdPolicyMgrImplTest.expireWarning(PswdPolicyMgrImplTest.java:535)
	at org.apache.directory.fortress.core.impl.PswdPolicyMgrImplTest.testExpireWarning(PswdPolicyMgrImplTest.java:460)


Results :

Failed tests: 
  PswdPolicyMgrImplTest.testExpireWarning:460->expireWarning:535 checkPwPolicies for userId
[jtsTU5User9] PASSWORD HAS EXPIRED

Tests run: 128, Failures: 1, Errors: 0, Skipped: 0

[INFO] ------------------------------------------------------------------------
[INFO] BUILD FAILURE
[INFO] ------------------------------------------------------------------------
[INFO] Total time:  56:41 min
[INFO] Finished at: 2021-05-01T23:34:26Z
[INFO] ------------------------------------------------------------------------
[ERROR] Failed to execute goal org.apache.maven.plugins:maven-surefire-plugin:2.18.1:test
(default-test) on project fortress-core: There are test failures.
[ERROR] 
[ERROR] Please refer to <https://ci-builds.apache.org/job/Directory/job/dir-fortress-core-docker-apacheds-test/ws/target/surefire-reports>
for the individual test results.
[ERROR] -> [Help 1]
[ERROR] 
[ERROR] To see the full stack trace of the errors, re-run Maven with the -e switch.
[ERROR] Re-run Maven using the -X switch to enable full debug logging.
[ERROR] 
[ERROR] For more information about the errors and possible solutions, please read the following
articles:
[ERROR] [Help 1] http://cwiki.apache.org/confluence/display/MAVEN/MojoFailureException
Build step 'Execute shell' marked build as failure

Mime
View raw message